id_mutation,date_mutation,numero_disposition,nature_mutation,valeur_fonciere,adresse_numero,adresse_suffixe,adresse_nom_voie,adresse_code_voie,code_postal,code_commune,nom_commune,code_departement,ancien_code_commune,ancien_nom_commune,id_parcelle,ancien_id_parcelle,numero_volume,lot1_numero,lot1_surface_carrez,lot2_numero,lot2_surface_carrez,lot3_numero,lot3_surface_carrez,lot4_numero,lot4_surface_carrez,lot5_numero,lot5_surface_carrez,nombre_lots,code_type_local,type_local,surface_reelle_bati,nombre_pieces_principales,code_nature_culture,nature_culture,code_nature_culture_speciale,nature_culture_speciale,surface_terrain,longitude,latitude
2019-129149,2019-01-04,000001,Vente en l'état futur d'achèvement,197000,39,,BD BLANCARDE,1213,13004,13204,Marseille 4e Arrondissement,13,,,132048180C0157,,,72,,,,,,,,,,1,,,,,,,,,,5.398965,43.303135
2019-129149,2019-01-04,000001,Vente en l'état futur d'achèvement,197000,39,,BD BLANCARDE,1213,13004,13204,Marseille 4e Arrondissement,13,,,132048180C0157,,,16,,,,,,,,,,1,,,,,,,,,,5.398965,43.303135
2019-129150,2019-01-04,000001,Vente,160000,36,,RUE BENEDIT,1054,13004,13204,Marseille 4e Arrondissement,13,,,132048170E0047,,,430,64.62,,,,,,,,,1,2,Appartement,65,3,,,,,,5.392878,43.307808
2019-129151,2019-01-04,000001,Vente,112000,4,,RUE ANTOINE PONS,0443,13004,13204,Marseille 4e Arrondissement,13,,,132048150L0081,,,109,70,89,,,,,,,,2,2,Appartement,70,3,,,,,,5.401388,43.29703
2019-129154,2019-01-11,000001,Vente,474000,110,,AV DE MONTOLIVET,6274,13004,13204,Marseille 4e Arrondissement,13,,,132048150A0066,,,,,,,,,,,,,0,1,Maison,95,5,S,sols,,,210,5.406485,43.309476
2019-129155,2019-01-09,000001,Vente,75000,41,,RUE TROIS FRERES CARASSO,9195,13004,13204,Marseille 4e Arrondissement,13,,,132048180B0108,,,3,40.91,9,,,,,,,,2,2,Appartement,42,2,,,,,,5.399803,43.304875
2019-129160,2019-01-08,000001,Vente,226000,12,,AV MAL FOCH,5679,13004,13204,Marseille 4e Arrondissement,13,,,132048180D0040,,,13,97.16,,,,,,,,,1,2,Appartement,100,4,,,,,,5.397139,43.302011
2019-129161,2019-01-04,000001,Vente,248000,6,,AV DES CHUTES LAVIE,2261,13004,13204,Marseille 4e Arrondissement,13,,,132048170D0112,,,218,,,,,,,,,,1,3,Dépendance,,0,,,,,,5.396951,43.309198
2019-129161,2019-01-04,000001,Vente,248000,6,,AV DES CHUTES LAVIE,2261,13004,13204,Marseille 4e Arrondissement,13,,,132048170D0112,,,110,83.2,160,,,,,,,,2,2,Appartement,82,4,,,,,,5.396951,43.309198
2019-129165,2019-01-16,000001,Vente,260030,123,,BD CAMILLE FLAMMARION,1619,13004,13204,Marseille 4e Arrondissement,13,,,132048170E0060,,,159,80.14,,,,,,,,,1,2,Appartement,79,4,,,,,,5.395294,43.307525
2019-129165,2019-01-16,000001,Vente,260030,123,,BD CAMILLE FLAMMARION,1619,13004,13204,Marseille 4e Arrondissement,13,,,132048170E0060,,,47,,,,,,,,,,1,3,Dépendance,,0,,,,,,5.395294,43.307525
2019-129166,2019-01-04,000001,Vente,178000,1,,RUE ORGUES,6699,13004,13204,Marseille 4e Arrondissement,13,,,132048180E0154,,,3,77.09,,,,,,,,,1,2,Appartement,78,4,,,,,,5.39789,43.299853
2019-129169,2019-01-11,000001,Vente,50000,163,,BD BOISSON,1262,13004,13204,Marseille 4e Arrondissement,13,,,132048150K0149,,,45,15.5,,,,,,,,,1,2,Appartement,20,2,,,,,,5.404322,43.296532
2019-129171,2019-01-09,000001,Vente,110000,46,,AV MAL FOCH,5679,13004,13204,Marseille 4e Arrondissement,13,,,132048150M0166,,,4,,,,,,,,,,1,2,Appartement,70,3,,,,,,5.401437,43.299129
2019-129180,2019-01-10,000001,Vente,630000,35,,RUE MARX DORMOY,5859,13004,13204,Marseille 4e Arrondissement,13,,,132048180I0058,,,2,,8,,,,,,,,2,2,Appartement,66,2,,,,,,5.396673,43.300899
2019-129180,2019-01-10,000001,Vente,630000,35,,RUE MARX DORMOY,5859,13004,13204,Marseille 4e Arrondissement,13,,,132048180I0058,,,1,,,,,,,,,,1,3,Dépendance,,0,,,,,,5.396673,43.300899
2019-129180,2019-01-10,000001,Vente,630000,35,,RUE MARX DORMOY,5859,13004,13204,Marseille 4e Arrondissement,13,,,132048180I0058,,,1,,,,,,,,,,1,3,Dépendance,,0,,,,,,5.396673,43.300899
2019-129180,2019-01-10,000001,Vente,630000,35,,RUE MARX DORMOY,5859,13004,13204,Marseille 4e Arrondissement,13,,,132048180I0058,,,1,,,,,,,,,,1,3,Dépendance,,0,,,,,,5.396673,43.300899
2019-129180,2019-01-10,000001,Vente,630000,35,,RUE MARX DORMOY,5859,13004,13204,Marseille 4e Arrondissement,13,,,132048180I0058,,,2,,,,,,,,,,1,3,Dépendance,,0,,,,,,5.396673,43.300899
2019-129184,2019-01-11,000001,Vente,104000,5,,BD ISIDORE DAGNAN,4601,13004,13204,Marseille 4e Arrondissement,13,,,132048170H0180,,,4,,,,,,,,,,1,3,Dépendance,,0,,,,,,5.393709,43.309786
2019-129184,2019-01-11,000001,Vente,104000,5,,BD ISIDORE DAGNAN,4601,13004,13204,Marseille 4e Arrondissement,13,,,132048170H0180,,,3,58.97,7,,,,,,,,2,2,Appartement,60,3,,,,,,5.393709,43.309786
2019-129184,2019-01-11,000001,Vente,104000,10,,BD DAHDAH,2676,13004,13204,Marseille 4e Arrondissement,13,,,132048170H0181,,,128,,,,,,,,,,1,3,Dépendance,,0,,,,,,5.393465,43.3098
2019-129186,2019-01-15,000001,Vente,108000,118,,BD BLANCARDE,1213,13004,13204,Marseille 4e Arrondissement,13,,,132048150E0006,,,3,,5,48.01,,,,,,,2,2,Appartement,47,2,,,,,,5.404785,43.303207
2019-129195,2019-01-14,000001,Vente en l'état futur d'achèvement,124000,13,,BD MEYER,6013,13004,13204,Marseille 4e Arrondissement,13,,,132048160A0146,,,35,,,,,,,,,,1,,,,,,,,,,5.404257,43.313339
2019-129195,2019-01-14,000001,Vente en l'état futur d'achèvement,124000,13,,BD MEYER,6013,13004,13204,Marseille 4e Arrondissement,13,,,132048160A0146,,,201,34,,,,,,,,,1,,,,,,,,,,5.404257,43.313339
2019-129196,2019-01-15,000001,Vente en l'état futur d'achèvement,139000,13,,BD MEYER,6013,13004,13204,Marseille 4e Arrondissement,13,,,132048160A0146,,,150,37,,,,,,,,,1,,,,,,,,,,5.404257,43.313339
2019-129196,2019-01-15,000001,Vente en l'état futur d'achèvement,139000,13,,BD MEYER,6013,13004,13204,Marseille 4e Arrondissement,13,,,132048160A0146,,,86,,,,,,,,,,1,,,,,,,,,,5.404257,43.313339
2019-129201,2019-01-17,000001,Vente,131000,12,,RUE ANTOINE PONS,0443,13004,13204,Marseille 4e Arrondissement,13,,,132048150L0081,,,238,,254,,,,,,,,2,2,Appartement,73,4,,,,,,5.401388,43.29703
2019-129202,2019-01-10,000001,Vente,129000,80,,RUE TROIS FRERES CARASSO,9195,13004,13204,Marseille 4e Arrondissement,13,,,132048180B0134,,,3,60.48,9,,,,,,,,2,2,Appartement,68,3,,,,,,5.400586,43.306332
2019-129204,2019-01-16,000001,Vente,120000,23,,AV DES CHARTREUX,2128,13004,13204,Marseille 4e Arrondissement,13,,,132048180C0192,,,101,57.93,31,,,,,,,,2,2,Appartement,58,3,,,,,,5.397645,43.303944
2019-129209,2019-01-09,000001,Vente,225000,15,,RUE JEANNE JUGAN,4807,13004,13204,Marseille 4e Arrondissement,13,,,132048170D0141,,,118,,,,,,,,,,1,3,Dépendance,,0,,,,,,5.397584,43.309378
2019-129209,2019-01-09,000001,Vente,225000,15,,RUE JEANNE JUGAN,4807,13004,13204,Marseille 4e Arrondissement,13,,,132048170D0141,,,9,89.02,,,,,,,,,1,2,Appartement,87,4,,,,,,5.397584,43.309378
2019-129212,2019-01-16,000001,Vente,55100,8,,RUE CHAPE,2032,13004,13204,Marseille 4e Arrondissement,13,,,132048180K0091,,,3,,,,,,,,,,1,2,Appartement,14,1,,,,,,5.389978,43.299293
2019-129213,2019-01-12,000001,Vente,131000,2,,RUE HENRI JURAMY,4991,13004,13204,Marseille 4e Arrondissement,13,,,132048180H0063,,,1,,7,,,,,,,,2,2,Appartement,54,2,,,,,,5.400019,43.299313
2019-129215,2019-01-04,000001,Vente,33500,11,,RUE SAINTE SOPHIE,8575,13004,13204,Marseille 4e Arrondissement,13,,,132048160D0133,,,1,13.15,,,,,,,,,1,2,Appartement,13,1,,,,,,5.402798,43.306947
2019-129218,2019-01-14,000001,Vente,10000,14,,RUE GRANON,4251,13004,13204,Marseille 4e Arrondissement,13,,,132048170B0052,,,301,,,,,,,,,,1,3,Dépendance,,0,,,,,,5.400696,43.313085
2019-129223,2019-01-03,000001,Vente,375000,70,,BD ROUGIER,8138,13004,13204,Marseille 4e Arrondissement,13,,,132048150N0063,,,,,,,,,,,,,0,2,Appartement,30,2,S,sols,,,114,5.401718,43.305708
2019-129223,2019-01-03,000001,Vente,375000,70,,BD ROUGIER,8138,13004,13204,Marseille 4e Arrondissement,13,,,132048150N0063,,,,,,,,,,,,,0,2,Appartement,30,2,S,sols,,,114,5.401718,43.305708
2019-129223,2019-01-03,000001,Vente,375000,70,,BD ROUGIER,8138,13004,13204,Marseille 4e Arrondissement,13,,,132048150N0063,,,,,,,,,,,,,0,2,Appartement,30,2,S,sols,,,114,5.401718,43.305708
2019-129223,2019-01-03,000001,Vente,375000,70,,BD ROUGIER,8138,13004,13204,Marseille 4e Arrondissement,13,,,132048150N0063,,,,,,,,,,,,,0,2,Appartement,30,1,S,sols,,,114,5.401718,43.305708
2019-129223,2019-01-03,000001,Vente,375000,70,,BD ROUGIER,8138,13004,13204,Marseille 4e Arrondissement,13,,,132048150N0063,,,,,,,,,,,,,0,2,Appartement,60,2,S,sols,,,114,5.401718,43.305708
2019-129223,2019-01-03,000001,Vente,375000,70,,BD ROUGIER,8138,13004,13204,Marseille 4e Arrondissement,13,,,132048150N0063,,,,,,,,,,,,,0,2,Appartement,30,2,S,sols,,,114,5.401718,43.305708
2019-129225,2019-01-07,000001,Vente,17000,5001,,CITE BEAUSOLEIL B ROUX PR,A121,13004,13204,Marseille 4e Arrondissement,13,,,132048150B0028,,,467,,,,,,,,,,1,3,Dépendance,,0,,,,,,5.407849,43.308658
2019-129228,2019-01-16,000001,Vente,120000,1,,IMP ST CHARLES,8274,13004,13204,Marseille 4e Arrondissement,13,,,132048170D0109,,,111,77.28,96,,,,,,,,2,2,Appartement,80,4,,,,,,5.397745,43.309594
2019-129231,2019-01-15,000001,Vente,100000,26,,RUE TROIS FRERES CARASSO,9195,13004,13204,Marseille 4e Arrondissement,13,,,132048180C0099,,,37,41.33,,,,,,,,,1,2,Appartement,43,2,,,,,,5.400317,43.304128
2019-129236,2019-01-10,000001,Vente,13000,16,,BD DE LA FEDERATION,3385,13004,13204,Marseille 4e Arrondissement,13,,,132048160H0172,,,1161,,,,,,,,,,1,3,Dépendance,,0,,,,,,5.403286,43.311538
2019-129237,2019-01-11,000001,Vente,322000,6,,RUE DE PROVENCE,7599,13004,13204,Marseille 4e Arrondissement,13,,,132048180I0152,,,112,105.32,29,,,,,,,,2,2,Appartement,110,4,,,,,,5.396563,43.301315
2019-129238,2019-01-08,000001,Vente,159000,26,B,BD DU COLONEL ROBERT ROSSI,2431,13004,13204,Marseille 4e Arrondissement,13,,,132048150D0201,,,36,,,,,,,,,,1,3,Dépendance,,0,,,,,,5.403999,43.305485
2019-129238,2019-01-08,000001,Vente,159000,26,B,BD DU COLONEL ROBERT ROSSI,2431,13004,13204,Marseille 4e Arrondissement,13,,,132048150D0201,,,28,,68,78.8,,,,,,,2,2,Appartement,82,4,,,,,,5.403999,43.305485
2019-129239,2019-01-02,000001,Vente,145000,139,,BD BLANCARDE,1213,13004,13204,Marseille 4e Arrondissement,13,,,132048150D0210,,,39,,,,,,,,,,1,3,Dépendance,,0,,,,,,5.405289,43.303745
2019-129239,2019-01-02,000001,Vente,145000,139,,BD BLANCARDE,1213,13004,13204,Marseille 4e Arrondissement,13,,,132048150D0210,,,47,76.24,6,,,,,,,,2,2,Appartement,76,3,,,,,,5.405289,43.303745
2019-129243,2019-01-09,000001,Vente,90000,15,,BD DE LA FEDERATION,3385,13004,13204,Marseille 4e Arrondissement,13,,,132048160H0164,,,621,40.29,622,,,,,,,,2,2,Appartement,40,2,,,,,,5.401515,43.310745
2019-129244,2019-01-10,000001,Vente,111000,13,,RUE MODESTE,6148,13004,13204,Marseille 4e Arrondissement,13,,,132048170D0047,,,17,64.51,,,,,,,,,1,2,Appartement,42,4,,,,,,5.397075,43.310464
2019-129248,2019-01-03,000001,Vente,280000,86,,AV DES CHARTREUX,2128,13004,13204,Marseille 4e Arrondissement,13,,,132048180B0084,,,1,,,,,,,,,,1,2,Appartement,30,1,,,,,,5.39958,43.305465
2019-129248,2019-01-03,000001,Vente,280000,86,,AV DES CHARTREUX,2128,13004,13204,Marseille 4e Arrondissement,13,,,132048180B0084,,,1,,,,,,,,,,1,4,Local industriel. commercial ou assimilé,30,0,,,,,,5.39958,43.305465
2019-129250,2019-01-21,000001,Vente,68000,105,,RUE ALBE,0128,13004,13204,Marseille 4e Arrondissement,13,,,132048160A0056,,,48,63.69,58,,,,,,,,2,2,Appartement,63,4,,,,,,5.405491,43.312876
2019-129257,2019-01-08,000001,Vente,150000,5,,RUE CAPAZZA,1710,13004,13204,Marseille 4e Arrondissement,13,,,132048180E0223,,,13,69.35,14,,,,,,,,2,2,Appartement,71,3,,,,,,5.400123,43.301098
2019-129258,2019-01-24,000001,Vente,125000,10,,BD DE ROUX,8166,13004,13204,Marseille 4e Arrondissement,13,,,132048150B0037,,,21,57.29,,,,,,,,,1,2,Appartement,57,3,,,,,,5.407881,43.30628
2019-129259,2019-01-28,000001,Vente,108000,10,,BD DE ROUX,8166,13004,13204,Marseille 4e Arrondissement,13,,,132048150B0037,,,30,,,,,,,,,,1,2,Appartement,65,3,,,,,,5.407881,43.30628
2019-129260,2019-01-03,000001,Vente,70000,112,,BD CAMILLE FLAMMARION,1619,13004,13204,Marseille 4e Arrondissement,13,,,132048180A0025,,,14,,,,,,,,,,1,3,Dépendance,,0,,,,,,5.39633,43.30764
2019-129260,2019-01-03,000001,Vente,70000,112,,BD CAMILLE FLAMMARION,1619,13004,13204,Marseille 4e Arrondissement,13,,,132048180A0025,,,30,,57,,,,,,,,2,2,Appartement,55,2,,,,,,5.39633,43.30764
2019-129261,2019-01-03,000001,Vente,97000,115,,AV DE MONTOLIVET,6274,13004,13204,Marseille 4e Arrondissement,13,,,132048160C0286,,,3,,,,,,,,,,1,2,Appartement,51,3,,,,,,5.40794,43.309666
2019-129261,2019-01-03,000001,Vente,97000,115,,AV DE MONTOLIVET,6274,13004,13204,Marseille 4e Arrondissement,13,,,132048160C0286,,,5,,,,,,,,,,1,3,Dépendance,,0,,,,,,5.40794,43.309666
2019-129267,2019-01-11,000001,Vente,199000,44,,RUE BOSCARY,1341,13004,13204,Marseille 4e Arrondissement,13,,,132048150M0216,,,29,,,,,,,,,,1,3,Dépendance,,0,,,,,,5.403097,43.301126
2019-129267,2019-01-11,000001,Vente,199000,46,,RUE BOSCARY,1341,13004,13204,Marseille 4e Arrondissement,13,,,132048150M0216,,,57,,69,,,,,,,,2,2,Appartement,82,3,,,,,,5.403097,43.301126
2019-129269,2019-01-23,000001,Vente,50000,1,,BD HOPKINSON,4501,13004,13204,Marseille 4e Arrondissement,13,,,132048150H0063,,,11,64.87,,,,,,,,,1,2,Appartement,64,4,,,,,,5.406714,43.298249
2019-129272,2019-01-21,000001,Vente,139000,2,,IMP DES BOMBINETTES,1264,13004,13204,Marseille 4e Arrondissement,13,,,132048150H0068,,,1,,19,69.05,,,,,,,2,2,Appartement,69,4,,,,,,5.405222,43.299941
2019-129273,2019-01-14,000001,Vente en l'état futur d'achèvement,209783,,,,,,13204,Marseille 4e Arrondissement,13,,,132048150E0033,,,32,,,,,,,,,,1,,,,,,,,,,5.405721,43.302649
2019-129273,2019-01-14,000001,Vente en l'état futur d'achèvement,209783,,,,,,13204,Marseille 4e Arrondissement,13,,,132048150E0033,,,126,,,,,,,,,,1,,,,,,,,,,5.405721,43.302649
2019-129274,2019-01-14,000001,Vente,149000,10,,BD ALTERAS,0275,13004,13204,Marseille 4e Arrondissement,13,,,132048160D0043,,,1,,,,,,,,,,1,2,Appartement,50,2,,,,,,5.402176,43.308785
2019-129288,2019-01-07,000001,Vente,93000,57,C,BD DE ROUX,8166,13004,13204,Marseille 4e Arrondissement,13,,,132048150A0118,,,4,,,,,,,,,,1,2,Appartement,53,3,,,,,,5.405676,43.307416
2019-129289,2019-01-10,000001,Vente,110800,132,,RUE ALBE,0128,13004,13204,Marseille 4e Arrondissement,13,,,132048160B0090,,,111,63.05,308,,,,,,,,2,2,Appartement,64,4,,,,,,5.407819,43.31356
2019-129292,2019-01-22,000001,Vente,5500,9,,RUE BEAU,0903,13004,13204,Marseille 4e Arrondissement,13,,,132048150I0157,,,25,,,,,,,,,,1,3,Dépendance,,0,,,,,,5.408531,43.298092
2019-129293,2019-01-17,000001,Vente,14000,1,,RUE ANTOINE PONS,0443,13004,13204,Marseille 4e Arrondissement,13,,,132048150L0010,,,179,,,,,,,,,,1,3,Dépendance,,0,,,,,,5.401439,43.29784
2019-129297,2019-01-07,000001,Vente en l'état futur d'achèvement,203000,39,,BD BLANCARDE,1213,13004,13204,Marseille 4e Arrondissement,13,,,132048180C0157,,,69,,,,,,,,,,1,,,,,,,,,,5.398965,43.303135
2019-129308,2019-01-18,000001,Vente,130000,113,,BD BOISSON,1262,13004,13204,Marseille 4e Arrondissement,13,,,132048150K0132,,,42,,6,75.75,,,,,,,2,2,Appartement,72,4,,,,,,5.404092,43.298949
2019-129317,2019-01-17,000001,Vente,95000,46,A,RUE EUGENE CAS,3278,13004,13204,Marseille 4e Arrondissement,13,,,132048170C0008,,,13,54.08,9,,,,,,,,2,2,Appartement,57,3,,,,,,5.39774,43.313317
2019-129322,2019-01-29,000001,Vente en l'état futur d'achèvement,17000,13,,BD MEYER,6013,13004,13204,Marseille 4e Arrondissement,13,,,132048160A0146,,,44,,,,,,,,,,1,,,,,,,,,,5.404257,43.313339
2019-129324,2019-01-29,000001,Vente,86000,38,,BD FRANCOISE DUPARC,3731,13004,13204,Marseille 4e Arrondissement,13,,,132048150M0156,,,1,,12,32.85,,,,,,,2,2,Appartement,35,2,,,,,,5.401043,43.30215
2019-129327,2019-01-10,000001,Vente,362500,21,,RUE DE LA PEPINIERE,6981,13004,13204,Marseille 4e Arrondissement,13,,,132048170K0071,,,,,,,,,,,,,0,1,Maison,80,3,S,sols,,,279,5.395325,43.314023
2019-129327,2019-01-10,000001,Vente,362500,21,,RUE DE LA PEPINIERE,6981,13004,13204,Marseille 4e Arrondissement,13,,,132048170K0071,,,,,,,,,,,,,0,1,Maison,40,2,S,sols,,,279,5.395325,43.314023
2019-129327,2019-01-10,000001,Vente,362500,75,,BD GUIGOU,4312,13004,13204,Marseille 4e Arrondissement,13,,,132048170K0072,,,1,8.9,,,,,,,,,1,3,Dépendance,,0,,,,,,5.39525,43.313925
2019-129328,2019-01-15,000001,Vente,96000,18,,RUE GRANOUX,4253,13004,13204,Marseille 4e Arrondissement,13,,,132048180H0163,,,2,35.54,,,,,,,,,1,2,Appartement,36,2,,,,,,5.398524,43.298538
2019-129331,2019-01-08,000001,Vente,850000,15,,RUE MARECHAL FAYOLLE,5674,13004,13204,Marseille 4e Arrondissement,13,,,132048180E0081,,,,,,,,,,,,,0,4,Local industriel. commercial ou assimilé,20,0,S,sols,,,200,5.398652,43.300917
2019-129331,2019-01-08,000001,Vente,850000,15,,RUE MARECHAL FAYOLLE,5674,13004,13204,Marseille 4e Arrondissement,13,,,132048180E0081,,,,,,,,,,,,,0,2,Appartement,30,1,S,sols,,,200,5.398652,43.300917
2019-129331,2019-01-08,000001,Vente,850000,15,,RUE MARECHAL FAYOLLE,5674,13004,13204,Marseille 4e Arrondissement,13,,,132048180E0081,,,,,,,,,,,,,0,2,Appartement,45,2,S,sols,,,200,5.398652,43.300917
2019-129331,2019-01-08,000001,Vente,850000,15,,RUE MARECHAL FAYOLLE,5674,13004,13204,Marseille 4e Arrondissement,13,,,132048180E0081,,,,,,,,,,,,,0,2,Appartement,60,3,S,sols,,,200,5.398652,43.300917
2019-129331,2019-01-08,000001,Vente,850000,15,,RUE MARECHAL FAYOLLE,5674,13004,13204,Marseille 4e Arrondissement,13,,,132048180E0081,,,,,,,,,,,,,0,4,Local industriel. commercial ou assimilé,40,0,S,sols,,,200,5.398652,43.300917
2019-129331,2019-01-08,000001,Vente,850000,15,,RUE MARECHAL FAYOLLE,5674,13004,13204,Marseille 4e Arrondissement,13,,,132048180E0081,,,,,,,,,,,,,0,2,Appartement,30,1,S,sols,,,200,5.398652,43.300917
2019-129331,2019-01-08,000001,Vente,850000,15,,RUE MARECHAL FAYOLLE,5674,13004,13204,Marseille 4e Arrondissement,13,,,132048180E0081,,,,,,,,,,,,,0,2,Appartement,60,3,S,sols,,,200,5.398652,43.300917
2019-129331,2019-01-08,000001,Vente,850000,15,,RUE MARECHAL FAYOLLE,5674,13004,13204,Marseille 4e Arrondissement,13,,,132048180E0081,,,,,,,,,,,,,0,2,Appartement,60,3,S,sols,,,200,5.398652,43.300917
2019-129331,2019-01-08,000001,Vente,850000,15,,RUE MARECHAL FAYOLLE,5674,13004,13204,Marseille 4e Arrondissement,13,,,132048180E0081,,,,,,,,,,,,,0,2,Appartement,60,3,S,sols,,,200,5.398652,43.300917
2019-129331,2019-01-08,000001,Vente,850000,15,,RUE MARECHAL FAYOLLE,5674,13004,13204,Marseille 4e Arrondissement,13,,,132048180E0081,,,,,,,,,,,,,0,2,Appartement,45,2,S,sols,,,200,5.398652,43.300917
2019-129331,2019-01-08,000001,Vente,850000,15,,RUE MARECHAL FAYOLLE,5674,13004,13204,Marseille 4e Arrondissement,13,,,132048180E0081,,,,,,,,,,,,,0,2,Appartement,45,2,S,sols,,,200,5.398652,43.300917
2019-129331,2019-01-08,000001,Vente,850000,15,,RUE MARECHAL FAYOLLE,5674,13004,13204,Marseille 4e Arrondissement,13,,,132048180E0081,,,,,,,,,,,,,0,2,Appartement,45,2,S,sols,,,200,5.398652,43.300917
2019-129333,2019-01-22,000001,Vente,98000,10,,RUE FONDERE,3537,13004,13204,Marseille 4e Arrondissement,13,,,132048180E0037,,,10,55.75,,,,,,,,,1,2,Appartement,55,3,,,,,,5.399865,43.30178
2019-129334,2019-01-17,000001,Vente,71000,49,,IMP CROIX DE REGNIER,2627,13004,13204,Marseille 4e Arrondissement,13,,,132048180K0152,,,324,,356,24.52,,,,,,,2,2,Appartement,24,1,,,,,,5.39215,43.299795
2019-129337,2019-01-21,000001,Vente,4000,7,,BD SAKAKINI,8589,13004,13204,Marseille 4e Arrondissement,13,,,132048150L0061,,,19,13.71,,,,,,,,,1,3,Dépendance,,0,,,,,,5.401358,43.298691
2019-129341,2019-01-04,000001,Vente,97500,21,,RUE JEANNE JUGAN,4807,13004,13204,Marseille 4e Arrondissement,13,,,132048170D0138,,,140,,189,53.05,,,,,,,2,2,Appartement,54,2,,,,,,5.398384,43.309953
2019-129346,2019-01-30,000001,Vente,154000,10,,RUE DU MONASTERE,6178,13004,13204,Marseille 4e Arrondissement,13,,,132048150M0161,,,104,,,,,,,,,,1,3,Dépendance,,0,,,,,,5.401882,43.301479
2019-129346,2019-01-30,000001,Vente,154000,4,,RUE CHARLES DE FOUCAULD,2081,13004,13204,Marseille 4e Arrondissement,13,,,132048150M0161,,,55,,,,,,,,,,1,2,Appartement,80,4,,,,,,5.401882,43.301479
2019-129357,2019-01-15,000001,Vente,94000,25,,AV DES CHUTES LAVIE,2261,13004,13204,Marseille 4e Arrondissement,13,,,132048170K0039,,,101,,52,,64,,,,,,3,2,Appartement,68,5,,,,,,5.397064,43.314705
2019-129365,2019-01-25,000001,Vente,55000,22,,RUE ORGUES,6699,13004,13204,Marseille 4e Arrondissement,13,,,132048180H0191,,,19,,,,,,,,,,1,2,Appartement,26,1,,,,,,5.399283,43.29966
2019-129366,2019-01-22,000001,Vente,75000,36,,BD ISIDORE DAGNAN,4601,13004,13204,Marseille 4e Arrondissement,13,,,132048170D0139,,,71,36.15,,,,,,,,,1,2,Appartement,36,1,,,,,,5.395556,43.30922
2019-129384,2019-01-14,000001,Vente,93900,33,,RUE SAINT BRUNO,8267,13004,13204,Marseille 4e Arrondissement,13,,,132048160D0091,,,11,,5,,,,,,,,2,2,Appartement,41,2,,,,,,5.402686,43.307837
2019-129386,2019-01-25,000001,Vente,75000,11,,IMP DE ROUX,8173,13004,13204,Marseille 4e Arrondissement,13,,,132048150A0022,,,5,36.52,,,,,,,,,1,2,Appartement,25,3,,,,,,5.405261,43.307815
2019-129389,2019-01-31,000001,Vente,102000,34,,RUE MARECHAL FAYOLLE,5674,13004,13204,Marseille 4e Arrondissement,13,,,132048180E0149,,,39,36.6,7,,,,,,,,2,2,Appartement,35,1,,,,,,5.398318,43.29998
2019-129390,2019-01-18,000001,Vente en l'état futur d'achèvement,222000,,,,,,13204,Marseille 4e Arrondissement,13,,,132048160A0016,,,112,,,,,,,,,,1,,,,,,,,,,5.404578,43.313559
2019-129390,2019-01-18,000001,Vente en l'état futur d'achèvement,222000,,,,,,13204,Marseille 4e Arrondissement,13,,,132048160A0016,,,31,,,,,,,,,,1,,,,,,,,,,5.404578,43.313559
2019-129395,2019-01-16,000001,Vente,133000,10,,RUE FONDERE,3537,13004,13204,Marseille 4e Arrondissement,13,,,132048180E0037,,,9,55.19,,,,,,,,,1,2,Appartement,60,3,,,,,,5.399865,43.30178
2019-129409,2019-01-31,000001,Vente,103000,1,,RUE ROUSSEL DORIA,8155,13004,13204,Marseille 4e Arrondissement,13,,,132048180H0241,,,107,45.29,,,,,,,,,1,2,Appartement,44,2,,,,,,5.399033,43.299469
2019-129413,2019-01-22,000001,Vente,63000,1,,BD HONORET,4491,13004,13204,Marseille 4e Arrondissement,13,,,132048170C0082,,,26,,8,,,,,,,,2,2,Appartement,26,1,,,,,,5.397971,43.311382
2019-129414,2019-01-30,000001,Vente,190000,16,,RUE STE THERESE,8579,13004,13204,Marseille 4e Arrondissement,13,,,132048170H0076,,,6,,7,77.62,,,,,,,2,2,Appartement,77,3,,,,,,5.396041,43.310861
2019-129422,2019-01-17,000001,Vente,20000,65,,BD BANON,0723,13004,13204,Marseille 4e Arrondissement,13,,,132048160H0120,,,3,36.84,,,,,,,,,1,2,Appartement,27,1,,,,,,5.40383,43.310902
2019-129425,2019-01-28,000001,Vente,498000,1,,RUE RASPAIL,7749,13004,13204,Marseille 4e Arrondissement,13,,,132048180I0106,,,8,,,,,,,,,,1,3,Dépendance,,0,,,,,,5.396143,43.300738
2019-129425,2019-01-28,000001,Vente,498000,32,B,RUE MARX DORMOY,5859,13004,13204,Marseille 4e Arrondissement,13,,,132048180I0106,,,40,131.3,,,,,,,,,1,4,Local industriel. commercial ou assimilé,135,0,,,,,,5.396143,43.300738
2019-129425,2019-01-28,000001,Vente,498000,1,,RUE RASPAIL,7749,13004,13204,Marseille 4e Arrondissement,13,,,132048180I0106,,,13,,,,,,,,,,1,3,Dépendance,,0,,,,,,5.396143,43.300738
2019-129426,2019-02-04,000001,Vente,130000,40,,BD FRANCOISE DUPARC,3731,13004,13204,Marseille 4e Arrondissement,13,,,132048150M0153,,,8,85.82,,,,,,,,,1,2,Appartement,95,4,,,,,,5.401054,43.302262
2019-129433,2019-01-10,000001,Vente,105000,4,,BD GEORGES CLEMENCEAU,4041,13004,13204,Marseille 4e Arrondissement,13,,,132048180I0063,,,4,,,,,,,,,,1,4,Local industriel. commercial ou assimilé,40,0,,,,,,5.397284,43.30162
2019-129434,2019-01-26,000001,Vente,110000,38,,AV MAL FOCH,5679,13004,13204,Marseille 4e Arrondissement,13,,,132048180E0068,,,17,38.5,,,,,,,,,1,2,Appartement,35,1,,,,,,5.3999,43.30022
2019-129446,2019-01-31,000001,Vente,440000,133,,BD BLANCARDE,1213,13004,13204,Marseille 4e Arrondissement,13,,,132048150D0071,,,11,44.65,,,,,,,,,1,2,Appartement,40,1,,,,,,,
2019-129446,2019-01-31,000001,Vente,440000,133,,BD BLANCARDE,1213,13004,13204,Marseille 4e Arrondissement,13,,,132048150D0071,,,10,46.73,,,,,,,,,1,2,Appartement,40,1,,,,,,,