id_mutation,date_mutation,numero_disposition,nature_mutation,valeur_fonciere,adresse_numero,adresse_suffixe,adresse_nom_voie,adresse_code_voie,code_postal,code_commune,nom_commune,code_departement,ancien_code_commune,ancien_nom_commune,id_parcelle,ancien_id_parcelle,numero_volume,lot1_numero,lot1_surface_carrez,lot2_numero,lot2_surface_carrez,lot3_numero,lot3_surface_carrez,lot4_numero,lot4_surface_carrez,lot5_numero,lot5_surface_carrez,nombre_lots,code_type_local,type_local,surface_reelle_bati,nombre_pieces_principales,code_nature_culture,nature_culture,code_nature_culture_speciale,nature_culture_speciale,surface_terrain,longitude,latitude
2019-140608,2019-01-07,000001,Vente,110000,7,,AV DE LA PANOUSE,6771,13009,13209,Marseille 9e Arrondissement,13,,,132098470E0073,,,50,26.33,,,,,,,,,1,2,Appartement,26,2,,,,,,5.419392,43.257343
2019-140613,2019-01-03,000001,Vente,87000,296,,BD ROMAIN ROLLAND,8016,13009,13209,Marseille 9e Arrondissement,13,,,132098530C0053,,,49,,58,54,,,,,,,2,2,Appartement,60,3,,,,,,5.411123,43.275371
2019-140625,2019-01-04,000001,Vente,420000,3,B,BD LEON,5203,13009,13209,Marseille 9e Arrondissement,13,,,132098530V0003,,,2,90.68,,,,,,,,,1,1,Maison,89,4,,,,,,5.398723,43.265246
2019-140629,2019-01-11,000001,Vente,93000,296,,BD ROMAIN ROLLAND,8016,13009,13209,Marseille 9e Arrondissement,13,,,132098530C0026,,,66,,72,53.62,,,,,,,2,2,Appartement,56,3,,,,,,5.410878,43.274349
2019-140635,2019-01-09,000001,Vente,155000,124,,RUE AUGUSTIN AUBERT,0632,13009,13209,Marseille 9e Arrondissement,13,,,132098530R0003,,,164,46.69,,,,,,,,,1,2,Appartement,47,3,,,,,,,
2019-140636,2019-01-08,000001,Vente,100000,5,,AV MOISSERON,6157,13009,13209,Marseille 9e Arrondissement,13,,,132098490P0036,,,1,67.76,,,,,,,,,1,2,Appartement,68,3,,,,,,5.406801,43.249803
2019-140638,2019-01-08,000001,Vente,265150,4,,RUE THEOPHILE BOUDIER,8992,13009,13209,Marseille 9e Arrondissement,13,,,132098490N0087,,,4,,,,,,,,,,1,3,Dépendance,,0,,,,,,5.400821,43.246419
2019-140638,2019-01-08,000001,Vente,265150,4,,RUE THEOPHILE BOUDIER,8992,13009,13209,Marseille 9e Arrondissement,13,,,132098490N0087,,,16,81.7,,,,,,,,,1,2,Appartement,82,4,,,,,,5.400821,43.246419
2019-140650,2019-01-10,000002,Vente,267000,230,,VC ANCIEN CHEM DE CASSIS,0350,13009,13209,Marseille 9e Arrondissement,13,,,132098470H0113,,,,,,,,,,,,,0,2,Appartement,65,3,S,sols,,,119,5.418311,43.25806
2019-140650,2019-01-10,000002,Vente,267000,230,,VC ANCIEN CHEM DE CASSIS,0350,13009,13209,Marseille 9e Arrondissement,13,,,132098470H0113,,,,,,,,,,,,,0,2,Appartement,70,4,S,sols,,,119,5.418311,43.25806
2019-140650,2019-01-10,000002,Vente,267000,230,,VC ANCIEN CHEM DE CASSIS,0350,13009,13209,Marseille 9e Arrondissement,13,,,132098470H0113,,,,,,,,,,,,,0,2,Appartement,75,3,S,sols,,,119,5.418311,43.25806
2019-140650,2019-01-10,000002,Vente,267000,230,,VC ANCIEN CHEM DE CASSIS,0350,13009,13209,Marseille 9e Arrondissement,13,,,132098470H0113,,,,,,,,,,,,,0,3,Dépendance,,0,S,sols,,,119,5.418311,43.25806
2019-140659,2019-01-02,000001,Vente,228000,124,,RUE AUGUSTIN AUBERT,0632,13009,13209,Marseille 9e Arrondissement,13,,,132098530R0003,,,41,,,,,,,,,,1,3,Dépendance,,0,,,,,,,
2019-140659,2019-01-02,000001,Vente,228000,124,,RUE AUGUSTIN AUBERT,0632,13009,13209,Marseille 9e Arrondissement,13,,,132098530R0003,,,189,67.93,,,,,,,,,1,2,Appartement,69,3,,,,,,,
2019-140660,2019-01-07,000001,Vente,40000,1,,CHE COLLINE ST JOSEPH,2417,13009,13209,Marseille 9e Arrondissement,13,,,132098470I0090,,,541,19,,,,,,,,,1,3,Dépendance,,0,,,,,,5.413191,43.256341
2019-140674,2019-01-02,000001,Vente en l'état futur d'achèvement,5500,67,,TRA DE LA SEIGNEURIE,8687,13009,13209,Marseille 9e Arrondissement,13,,,132098490K0153,,,72,,,,,,,,,,1,3,Dépendance,,0,,,,,,5.41131,43.241168
2019-140674,2019-01-02,000001,Vente en l'état futur d'achèvement,5500,67,,TRA DE LA SEIGNEURIE,8687,13009,13209,Marseille 9e Arrondissement,13,,,132098490K0153,,,72,,,,,,,,,,1,3,Dépendance,,0,,,,,,5.41131,43.241168
2019-140679,2019-01-04,000001,Vente,114050,9001,,BEAUVALLON PINEDE,A125,13009,13209,Marseille 9e Arrondissement,13,,,132098460C0031,,,248,54.88,,,,,,,,,1,2,Appartement,56,3,,,,,,5.408506,43.239698
2019-140689,2019-01-11,000001,Vente,354710,127,,CHE DE MORGIOU,6321,13009,13209,Marseille 9e Arrondissement,13,,,132098460C0001,,,29,,55,91.98,,,,,,,2,2,Appartement,91,4,,,,,,5.408651,43.238906
2019-140689,2019-01-11,000001,Vente,354710,127,,CHE DE MORGIOU,6321,13009,13209,Marseille 9e Arrondissement,13,,,132098460C0001,,,9,,,,,,,,,,1,3,Dépendance,,0,,,,,,5.408651,43.238906
2019-140690,2019-01-11,000001,Vente,280000,189,,AV COLGATE,2386,13009,13209,Marseille 9e Arrondissement,13,,,132098520D0063,,,34,104.07,,,,,,,,,1,2,Appartement,105,4,,,,,,5.403356,43.232
2019-140690,2019-01-11,000001,Vente,280000,189,,AV COLGATE,2386,13009,13209,Marseille 9e Arrondissement,13,,,132098520D0063,,,114,,,,,,,,,,1,3,Dépendance,,0,,,,,,5.403356,43.232
2019-140690,2019-01-11,000001,Vente,280000,189,,AV COLGATE,2386,13009,13209,Marseille 9e Arrondissement,13,,,132098520D0063,,,115,,,,,,,,,,1,3,Dépendance,,0,,,,,,5.403356,43.232
2019-140695,2019-01-07,000001,Vente,20000,348,,BD MICHELET,6045,13009,13209,Marseille 9e Arrondissement,13,,,132098490X0020,,,847,,,,,,,,,,1,1,Maison,116,5,,,,,,5.398601,43.256736
2019-140697,2019-01-16,000001,Vente,691610,170,,RTE LEON LACHAMP,5217,13009,13209,Marseille 9e Arrondissement,13,,,132098540C0141,,,,,,,,,,,,,0,1,Maison,146,4,S,sols,,,2196,5.450117,43.249024
2019-140698,2019-01-16,000001,Vente,98000,296,,BD ROMAIN ROLLAND,8016,13009,13209,Marseille 9e Arrondissement,13,,,132098530C0047,,,30,58.73,,,,,,,,,1,2,Appartement,60,3,,,,,,5.411553,43.273632
2019-140700,2019-01-16,000001,Vente,165000,33,,AV DE LA MARTHELINE,5844,13009,13209,Marseille 9e Arrondissement,13,,,132098490N0207,,,44,,,,,,,,,,1,2,Appartement,65,2,,,,,,5.401336,43.24609
2019-140700,2019-01-16,000001,Vente,165000,33,,AV DE LA MARTHELINE,5844,13009,13209,Marseille 9e Arrondissement,13,,,132098490N0207,,,58,,,,,,,,,,1,3,Dépendance,,0,,,,,,5.401336,43.24609
2019-140703,2019-01-15,000001,Vente,125000,62,,RUE JULES ISAAC,4945,13009,13209,Marseille 9e Arrondissement,13,,,132098490U0089,,,11,51.04,,,,,,,,,1,2,Appartement,50,2,,,,,,5.399376,43.253571
2019-140712,2019-01-11,000001,Vente,110000,4,,SQ MICHELET,6048,13009,13209,Marseille 9e Arrondissement,13,,,132098530Y0048,,,27,,30,41.9,,,,,,,2,4,Local industriel. commercial ou assimilé,45,0,,,,,,5.395493,43.266981
2019-140718,2019-01-04,000001,Vente,176000,16,,IMP MARIE JULIE CHABRAN,5710,13009,13209,Marseille 9e Arrondissement,13,,,132098510H0175,,,34,,37,,,,,,,,2,2,Appartement,51,2,,,,,,5.423884,43.248496
2019-140718,2019-01-04,000001,Vente,176000,16,,IMP MARIE JULIE CHABRAN,5710,13009,13209,Marseille 9e Arrondissement,13,,,132098510H0175,,,19,,,,,,,,,,1,3,Dépendance,,0,,,,,,5.423884,43.248496
2019-140728,2019-01-11,000001,Vente,583765,3,,AV TAINE,8894,13009,13209,Marseille 9e Arrondissement,13,,,132098490B0003,,,,,,,,,,,,,0,1,Maison,120,5,S,sols,,,342,5.400708,43.25706
2019-140731,2019-01-18,000001,Vente,154000,14,,RUE CAPITAINE JEAN CROISA,4712,13009,13209,Marseille 9e Arrondissement,13,,,132098520C0217,,,48,,,,,,,,,,1,3,Dépendance,,0,,,,,,5.401435,43.236362
2019-140731,2019-01-18,000001,Vente,154000,14,,RUE CAPITAINE JEAN CROISA,4712,13009,13209,Marseille 9e Arrondissement,13,,,132098520C0217,,,58,51.8,,,,,,,,,1,2,Appartement,51,2,,,,,,5.401435,43.236362
2019-140736,2019-01-16,000001,Vente,264000,158,,CHE DE MORGIOU,6321,13009,13209,Marseille 9e Arrondissement,13,,,132098460A0334,,,26,84.23,,,,,,,,,1,2,Appartement,80,4,,,,,,5.407832,43.238513
2019-140736,2019-01-16,000001,Vente,264000,158,,CHE DE MORGIOU,6321,13009,13209,Marseille 9e Arrondissement,13,,,132098460A0334,,,4,,,,,,,,,,1,3,Dépendance,,0,,,,,,5.407832,43.238513
2019-140739,2019-01-15,000001,Vente,440000,9020,,CHE DU VAL DES BOIS,9282,13009,13209,Marseille 9e Arrondissement,13,,,132098470B0009,,,13,,,,,,,,,,1,1,Maison,108,6,,,,,,5.42605,43.263925
2019-140746,2019-01-16,000001,Vente,184000,31,,AV COLGATE,2386,13009,13209,Marseille 9e Arrondissement,13,,,132098460M0262,,,18,,,,,,,,,,1,3,Dépendance,,0,,,,,,5.408345,43.233478
2019-140746,2019-01-16,000001,Vente,184000,31,,AV COLGATE,2386,13009,13209,Marseille 9e Arrondissement,13,,,132098460M0262,,,38,67.21,,,,,,,,,1,2,Appartement,66,3,,,,,,5.408345,43.233478
2019-140759,2019-01-07,000001,Vente en l'état futur d'achèvement,172000,,,TRA DE LA GOUFFONNE,4166,13009,13209,Marseille 9e Arrondissement,13,,,132098490I0193,,,27,,,,,,,,,,1,,,,,,,,,,5.413871,43.247274
2019-140759,2019-01-07,000001,Vente en l'état futur d'achèvement,172000,,,TRA DE LA GOUFFONNE,4166,13009,13209,Marseille 9e Arrondissement,13,,,132098490I0193,,,212,,,,,,,,,,1,,,,,,,,,,5.413871,43.247274
2019-140765,2019-01-23,000001,Vente,208000,33,,SQ MICHELET,6048,13009,13209,Marseille 9e Arrondissement,13,,,132098530Y0021,,,10,76.35,,,,,,,,,1,2,Appartement,75,4,,,,,,5.395942,43.265685
2019-140766,2019-01-21,000001,Vente,325000,,,,,,13209,Marseille 9e Arrondissement,13,,,132098530P0025,,10,,,,,,,,,,,0,,,,,,,,,,5.404493,43.261569
2019-140774,2019-01-21,000001,Vente,235000,22,,AV MARCEL COTTREAU,5644,13009,13209,Marseille 9e Arrondissement,13,,,132098520A0173,,,,,,,,,,,,,0,1,Maison,120,4,S,sols,,,429,5.394134,43.243659
2019-140776,2019-01-04,000001,Vente,418500,2,,BD DU FELIBRIGE,3392,13009,13209,Marseille 9e Arrondissement,13,,,132098510C0070,,,,,,,,,,,,,0,1,Maison,85,3,S,sols,,,447,5.420855,43.243696
2019-140779,2019-01-18,000001,Vente,164000,9001,,RES VALMANTE,A923,13009,13209,Marseille 9e Arrondissement,13,,,132098490I0126,,,10597,85.16,10658,,,,,,,,2,2,Appartement,85,5,,,,,,5.411945,43.248244
2019-140789,2019-01-10,000001,Vente en l'état futur d'achèvement,214459,,,TRA DE LA GOUFFONNE,4166,13009,13209,Marseille 9e Arrondissement,13,,,132098490I0193,,,125,,,,,,,,,,1,,,,,,,,,,5.413871,43.247274
2019-140789,2019-01-10,000001,Vente en l'état futur d'achèvement,214459,,,TRA DE LA GOUFFONNE,4166,13009,13209,Marseille 9e Arrondissement,13,,,132098490I0194,,,131,,,,,,,,,,1,,,,,,,,,,5.414301,43.247939
2019-140791,2019-01-07,000001,Vente en l'état futur d'achèvement,284000,,,ALL CERVANTES,1940,13009,13209,Marseille 9e Arrondissement,13,,,132098520D0026,,,36,,,,,,,,,,1,,,,,,,,,,5.398412,43.233145
2019-140791,2019-01-07,000001,Vente en l'état futur d'achèvement,284000,,,ALL CERVANTES,1940,13009,13209,Marseille 9e Arrondissement,13,,,132098520D0026,,,120,,,,,,,,,,1,,,,,,,,,,5.398412,43.233145
2019-140795,2019-01-22,000001,Vente,13000,425,,BD ROMAIN ROLLAND,8016,13009,13209,Marseille 9e Arrondissement,13,,,132098530H0133,,,547,,,,,,,,,,1,3,Dépendance,,0,,,,,,5.405226,43.269062
2019-140804,2019-01-09,000001,Vente en l'état futur d'achèvement,135654,,,ALL CERVANTES,1940,13009,13209,Marseille 9e Arrondissement,13,,,132098520D0026,,,128,,,,,,,,,,1,,,,,,,,,,5.398412,43.233145
2019-140804,2019-01-09,000001,Vente en l'état futur d'achèvement,135654,,,ALL CERVANTES,1940,13009,13209,Marseille 9e Arrondissement,13,,,132098520D0026,,,24,,,,,,,,,,1,,,,,,,,,,5.398412,43.233145
2019-140805,2019-01-10,000001,Vente en l'état futur d'achèvement,161500,,,ALL CERVANTES,1940,13009,13209,Marseille 9e Arrondissement,13,,,132098520D0026,,,29,,,,,,,,,,1,,,,,,,,,,5.398412,43.233145
2019-140805,2019-01-10,000001,Vente en l'état futur d'achèvement,161500,,,ALL CERVANTES,1940,13009,13209,Marseille 9e Arrondissement,13,,,132098520D0026,,,108,,,,,,,,,,1,,,,,,,,,,5.398412,43.233145
2019-140806,2019-01-10,000001,Vente en l'état futur d'achèvement,220860,,,ALL CERVANTES,1940,13009,13209,Marseille 9e Arrondissement,13,,,132098520D0026,,,91,,,,,,,,,,1,,,,,,,,,,5.398412,43.233145
2019-140806,2019-01-10,000001,Vente en l'état futur d'achèvement,220860,,,ALL CERVANTES,1940,13009,13209,Marseille 9e Arrondissement,13,,,132098520D0026,,,17,,,,,,,,,,1,,,,,,,,,,5.398412,43.233145
2019-140810,2019-01-09,000001,Vente,102000,349,,BD ROMAIN ROLLAND,8016,13009,13209,Marseille 9e Arrondissement,13,,,132098530E0010,,,163,,173,,,,,,,,2,2,Appartement,52,3,,,,,,5.409128,43.270643
2019-140812,2019-01-09,000001,Vente,95000,296,,BD ROMAIN ROLLAND,8016,13009,13209,Marseille 9e Arrondissement,13,,,132098530C0047,,,47,48.1,,,,,,,,,1,2,Appartement,45,2,,,,,,5.411553,43.273632
2019-140830,2019-01-28,000001,Vente,157000,11,,IMP DE LA TURBINE,9238,13009,13209,Marseille 9e Arrondissement,13,,,132098520A0178,,,129,49.91,,,,,,,,,1,2,Appartement,49,2,,,,,,5.395073,43.240508
2019-140830,2019-01-28,000001,Vente,157000,11,,IMP DE LA TURBINE,9238,13009,13209,Marseille 9e Arrondissement,13,,,132098520A0178,,,33,,,,,,,,,,1,3,Dépendance,,0,,,,,,5.395073,43.240508
2019-140831,2019-01-16,000001,Vente,128000,22,,PARC DROMEL,A323,13009,13209,Marseille 9e Arrondissement,13,,,13209853AB0012,,,2064,67.31,2096,,,,,,,,2,2,Appartement,68,4,,,,,,,
2019-140846,2019-01-21,000001,Vente,172600,38,,BD DE MOSTAGANEM PROLONGE,6326,13009,13209,Marseille 9e Arrondissement,13,,,132098490U0010,,,87,61.75,,,,,,,,,1,2,Appartement,75,3,,,,,,5.396338,43.253215
2019-140855,2019-01-22,000001,Vente,120000,11,,SQ JEAN BOUIN,A453,13009,13209,Marseille 9e Arrondissement,13,,,132098530U0217,,,363,53.56,381,,,,,,,,2,2,Appartement,50,3,,,,,,,
2019-140859,2019-01-18,000001,Vente,92000,2,,BD DES ALISIERS,0219,13009,13209,Marseille 9e Arrondissement,13,,,132098470H0074,,,152,20,92,,,,,,,,2,2,Appartement,20,1,,,,,,5.41588,43.258031
2019-140865,2019-01-22,000001,Vente,150000,16,,RUE EMILE ZOLA,3119,13009,13209,Marseille 9e Arrondissement,13,,,132098490N0055,,,434,,,,,,,,,,1,3,Dépendance,,0,,,,,,5.39982,43.247259
2019-140866,2019-01-16,000001,Vente,204000,10,,RES CHATEAU SEC,A244,13009,13209,Marseille 9e Arrondissement,13,,,132098490H0108,,,1383,,1496,,,,,,,,2,2,Appartement,72,3,,,,,,5.409098,43.255828
2019-140867,2019-01-18,000001,Vente,162000,83,,BD DU REDON,7795,13009,13209,Marseille 9e Arrondissement,13,,,132098500D0238,,,8631,76.23,8692,,,,,,,,2,2,Appartement,76,3,,,,,,5.426145,43.251494
2019-140874,2019-01-23,000001,Vente en l'état futur d'achèvement,203000,49,,AV MAL J DE L DE TASSIGNY,4718,13009,13209,Marseille 9e Arrondissement,13,,,132098490P0048,,,218,,,,,,,,,,1,2,Appartement,43,2,,,,,,5.407001,43.248403
2019-140874,2019-01-23,000001,Vente en l'état futur d'achèvement,203000,49,,AV MAL J DE L DE TASSIGNY,4718,13009,13209,Marseille 9e Arrondissement,13,,,132098490P0048,,,29,,,,,,,,,,1,3,Dépendance,,0,,,,,,5.407001,43.248403
2019-140877,2019-01-16,000001,Vente en l'état futur d'achèvement,249000,,,ALL CERVANTES,1940,13009,13209,Marseille 9e Arrondissement,13,,,132098520D0026,,,53,,,,,,,,,,1,,,,,,,,,,5.398412,43.233145
2019-140877,2019-01-16,000001,Vente en l'état futur d'achèvement,249000,,,ALL CERVANTES,1940,13009,13209,Marseille 9e Arrondissement,13,,,132098520D0026,,,145,,,,,,,,,,1,,,,,,,,,,5.398412,43.233145
2019-140879,2019-01-21,000001,Vente en l'état futur d'achèvement,121500,231,,AV MAL J DE L DE TASSIGNY,4718,13009,13209,Marseille 9e Arrondissement,13,,,132098510E0144,,,72,,,,,,,,,,1,2,Appartement,25,25,,,,,,5.426435,43.245119
2019-140884,2019-01-15,000001,Vente,214500,20,,CHE DU ROI D ESPAGNE,7997,13009,13209,Marseille 9e Arrondissement,13,,,132098520A0171,,,78,71.11,,,,,,,,,1,2,Appartement,71,3,,,,,,5.396619,43.242242
2019-140884,2019-01-15,000001,Vente,214500,20,,CHE DU ROI D ESPAGNE,7997,13009,13209,Marseille 9e Arrondissement,13,,,132098520A0171,,,90,,,,,,,,,,1,3,Dépendance,,0,,,,,,5.396619,43.242242
2019-140885,2019-01-07,000001,Vente,141000,8,,BD CHAULAN,2186,13009,13209,Marseille 9e Arrondissement,13,,,132098530S0062,,,13,53.51,7,,,,,,,,2,2,Appartement,54,3,,,,,,5.408624,43.264329
2019-140887,2019-01-31,000001,Vente,104000,121,,BD PAUL CLAUDEL,6890,13009,13209,Marseille 9e Arrondissement,13,,,132098530E0014,,,304,54.97,342,,,,,,,,2,2,Appartement,56,3,,,,,,5.411082,43.268499
2019-140901,2019-01-29,000001,Vente,135100,391,,BD ROMAIN ROLLAND,8016,13009,13209,Marseille 9e Arrondissement,13,,,132098530H0104,,,3,,,,,,,,,,1,3,Dépendance,,0,,,,,,5.407337,43.270176
2019-140901,2019-01-29,000001,Vente,135100,391,,BD ROMAIN ROLLAND,8016,13009,13209,Marseille 9e Arrondissement,13,,,132098530H0104,,,77,39.7,,,,,,,,,1,2,Appartement,40,2,,,,,,5.407337,43.270176
2019-140904,2019-01-29,000001,Vente,394000,64,,BD GILLIBERT,4092,13009,13209,Marseille 9e Arrondissement,13,,,132098530T0150,,,,,,,,,,,,,0,2,Appartement,23,1,S,sols,,,226,5.405116,43.264241
2019-140904,2019-01-29,000001,Vente,394000,64,,BD GILLIBERT,4092,13009,13209,Marseille 9e Arrondissement,13,,,132098530T0150,,,,,,,,,,,,,0,2,Appartement,32,1,S,sols,,,226,5.405116,43.264241
2019-140904,2019-01-29,000001,Vente,394000,64,,BD GILLIBERT,4092,13009,13209,Marseille 9e Arrondissement,13,,,132098530T0150,,,,,,,,,,,,,0,3,Dépendance,,0,S,sols,,,226,5.405116,43.264241
2019-140904,2019-01-29,000001,Vente,394000,64,,BD GILLIBERT,4092,13009,13209,Marseille 9e Arrondissement,13,,,132098530T0150,,,,,,,,,,,,,0,3,Dépendance,,0,S,sols,,,226,5.405116,43.264241
2019-140904,2019-01-29,000001,Vente,394000,64,,BD GILLIBERT,4092,13009,13209,Marseille 9e Arrondissement,13,,,132098530T0150,,,,,,,,,,,,,0,2,Appartement,32,2,S,sols,,,226,5.405116,43.264241
2019-140904,2019-01-29,000001,Vente,394000,64,,BD GILLIBERT,4092,13009,13209,Marseille 9e Arrondissement,13,,,132098530T0150,,,,,,,,,,,,,0,2,Appartement,23,1,S,sols,,,226,5.405116,43.264241
2019-140904,2019-01-29,000001,Vente,394000,64,,BD GILLIBERT,4092,13009,13209,Marseille 9e Arrondissement,13,,,132098530T0150,,,,,,,,,,,,,0,2,Appartement,15,1,S,sols,,,226,5.405116,43.264241
2019-140904,2019-01-29,000001,Vente,394000,64,,BD GILLIBERT,4092,13009,13209,Marseille 9e Arrondissement,13,,,132098530T0150,,,,,,,,,,,,,0,2,Appartement,12,1,S,sols,,,226,5.405116,43.264241
2019-140907,2019-02-04,000001,Vente,321050,72,,ALL GRANADOS,4191,13009,13209,Marseille 9e Arrondissement,13,,,132098520H0061,,,164,,78,119.7,,,,,,,2,2,Appartement,120,6,,,,,,5.393632,43.236421
2019-140912,2019-01-21,000001,Vente en l'état futur d'achèvement,193000,,,TRA DE LA GOUFFONNE,4166,13009,13209,Marseille 9e Arrondissement,13,,,132098490I0193,,,132,,,,,,,,,,1,,,,,,,,,,5.413871,43.247274
2019-140912,2019-01-21,000001,Vente en l'état futur d'achèvement,193000,,,TRA DE LA GOUFFONNE,4166,13009,13209,Marseille 9e Arrondissement,13,,,132098490I0193,,,85,,,,,,,,,,1,,,,,,,,,,5.413871,43.247274
2019-140915,2019-01-16,000001,Vente,211500,105,,BD DU CABOT,1540,13009,13209,Marseille 9e Arrondissement,13,,,132098470B0059,,,1014,,1041,65.61,,,,,,,2,2,Appartement,71,2,,,,,,5.423956,43.260655
2019-140915,2019-01-16,000001,Vente,211500,9001,,AV CAMPAGNE BERGER,1639,13009,13209,Marseille 9e Arrondissement,13,,,132098470B0059,,,172,,,,,,,,,,1,3,Dépendance,,0,,,,,,5.423956,43.260655
2019-140919,2019-01-17,000001,Vente,96000,201,,SQ LA CRAVACHE,2600,13009,13209,Marseille 9e Arrondissement,13,,,132098530X0047,,,54,49.26,72,,,,,,,,2,2,Appartement,51,3,,,,,,5.398017,43.263257
2019-140921,2019-01-21,000001,Vente,99000,296,,BD ROMAIN ROLLAND,8016,13009,13209,Marseille 9e Arrondissement,13,,,132098530C0047,,,23,58.31,,,,,,,,,1,2,Appartement,60,3,,,,,,5.411553,43.273632
2019-140926,2019-01-28,000001,Vente,156800,26,,BD GUSTAVE GANAY,4340,13009,13209,Marseille 9e Arrondissement,13,,,132098530V0059,,,5,88.24,,,,,,,,,1,2,Appartement,115,4,,,,,,5.401465,43.26616
2019-140927,2019-01-30,000001,Vente,400000,9901,,CHE JEAN ROUBIN,4790,13009,13209,Marseille 9e Arrondissement,13,,,132098490D0033,,,,,,,,,,,,,0,4,Local industriel. commercial ou assimilé,,0,S,sols,,,529,5.405173,43.2527
2019-140927,2019-01-30,000001,Vente,400000,9901,,CHE JEAN ROUBIN,4790,13009,13209,Marseille 9e Arrondissement,13,,,132098490D0033,,,,,,,,,,,,,0,4,Local industriel. commercial ou assimilé,,0,S,sols,,,529,5.405173,43.2527
2019-140927,2019-01-30,000001,Vente,400000,9901,,CHE JEAN ROUBIN,4790,13009,13209,Marseille 9e Arrondissement,13,,,132098490D0033,,,,,,,,,,,,,0,4,Local industriel. commercial ou assimilé,,0,S,sols,,,529,5.405173,43.2527
2019-140927,2019-01-30,000001,Vente,400000,9901,,CHE JEAN ROUBIN,4790,13009,13209,Marseille 9e Arrondissement,13,,,132098490D0033,,,,,,,,,,,,,0,1,Maison,69,4,S,sols,,,529,5.405173,43.2527
2019-140928,2019-01-29,000001,Vente,222500,58,,CHE DU VAL DES BOIS,9282,13009,13209,Marseille 9e Arrondissement,13,,,132098470B0056,,,160,,,,,,,,,,1,3,Dépendance,,0,,,,,,5.426742,43.265375
2019-140928,2019-01-29,000001,Vente,222500,58,,CHE DU VAL DES BOIS,9282,13009,13209,Marseille 9e Arrondissement,13,,,132098470B0056,,,58,73.66,,,,,,,,,1,2,Appartement,72,4,,,,,,5.426742,43.265375
2019-140930,2019-01-25,000001,Vente,82000,121,,BD PAUL CLAUDEL,6890,13009,13209,Marseille 9e Arrondissement,13,,,132098530E0014,,,124,55.49,244,,,,,,,,2,2,Appartement,66,4,,,,,,5.411082,43.268499
2019-140931,2019-01-17,000001,Vente,350000,228,,CHE DE MORGIOU,6321,13009,13209,Marseille 9e Arrondissement,13,,,132098460B0296,,,90,89.69,,,,,,,,,1,2,Appartement,89,4,,,,,,5.41095,43.233912
2019-140931,2019-01-17,000001,Vente,350000,228,,CHE DE MORGIOU,6321,13009,13209,Marseille 9e Arrondissement,13,,,132098460B0296,,,84,,,,,,,,,,1,3,Dépendance,,0,,,,,,5.41095,43.233912
2019-140931,2019-01-17,000001,Vente,350000,228,,CHE DE MORGIOU,6321,13009,13209,Marseille 9e Arrondissement,13,,,132098460B0296,,,88,,,,,,,,,,1,3,Dépendance,,0,,,,,,5.41095,43.233912
2019-140931,2019-01-17,000001,Vente,350000,228,,CHE DE MORGIOU,6321,13009,13209,Marseille 9e Arrondissement,13,,,132098460B0296,,,26,,,,,,,,,,1,3,Dépendance,,0,,,,,,5.41095,43.233912
2019-140932,2019-01-22,000001,Vente,230000,9005,,CHE COLLINE ST JOSEPH,2417,13009,13209,Marseille 9e Arrondissement,13,,,132098470I0055,,,178,,213,94.04,,,,,,,2,2,Appartement,94,4,,,,,,5.414101,43.254486
2019-140932,2019-01-22,000001,Vente,230000,9005,,CHE COLLINE ST JOSEPH,2417,13009,13209,Marseille 9e Arrondissement,13,,,132098470I0055,,,241,,,,,,,,,,1,3,Dépendance,,0,,,,,,5.414101,43.254486
2019-140932,2019-01-22,000001,Vente,230000,9005,,CHE COLLINE ST JOSEPH,2417,13009,13209,Marseille 9e Arrondissement,13,,,132098470I0055,,,258,,,,,,,,,,1,3,Dépendance,,0,,,,,,5.414101,43.254486
2019-140934,2019-01-11,000001,Vente,198000,84,,BD DU REDON,7795,13009,13209,Marseille 9e Arrondissement,13,,,132098470I0006,,,1862,,,,,,,,,,1,3,Dépendance,,0,,,,,,5.416701,43.255727
2019-140934,2019-01-11,000001,Vente,198000,84,,BD DU REDON,7795,13009,13209,Marseille 9e Arrondissement,13,,,132098470I0006,,,1063,,1258,86.33,,,,,,,2,2,Appartement,86,4,,,,,,5.416701,43.255727
2019-140951,2019-01-23,000001,Vente,271250,175,,VC ANCIEN CHEM DE CASSIS,0350,13009,13209,Marseille 9e Arrondissement,13,,,132098470D0114,,,158,,,,,,,,,,1,3,Dépendance,,0,,,,,,5.418556,43.260334
2019-140951,2019-01-23,000001,Vente,271250,175,,VC ANCIEN CHEM DE CASSIS,0350,13009,13209,Marseille 9e Arrondissement,13,,,132098470D0114,,,176,,,,,,,,,,1,2,Appartement,96,3,,,,,,5.418556,43.260334
2019-140952,2019-01-24,000001,Vente,85000,83,,BD DU REDON,7795,13009,13209,Marseille 9e Arrondissement,13,,,132098500D0238,,,848,38.96,912,,,,,,,,2,2,Appartement,40,2,,,,,,5.426145,43.251494
2019-140954,2019-01-30,000001,Vente,204000,14,,CHE VALLON DE TOULOUSE,9087,13009,13209,Marseille 9e Arrondissement,13,,,132098470A0164,,,104,,,,,,,,,,1,2,Appartement,71,3,,,,,,5.418883,43.266351
2019-140954,2019-01-30,000001,Vente,204000,14,A,CHE VALLON DE TOULOUSE,9087,13009,13209,Marseille 9e Arrondissement,13,,,132098470A0164,,,26,,,,,,,,,,1,3,Dépendance,,0,,,,,,5.418883,43.266351
2019-140954,2019-01-30,000001,Vente,204000,14,A,CHE VALLON DE TOULOUSE,9087,13009,13209,Marseille 9e Arrondissement,13,,,132098470A0164,,,46,,,,,,,,,,1,3,Dépendance,,0,,,,,,5.418883,43.266351
2019-140955,2019-01-29,000001,Vente,3500,1,,RES LE LANCIER,A505,13009,13209,Marseille 9e Arrondissement,13,,,132098490N0094,,,667,,,,,,,,,,1,3,Dépendance,,0,,,,,,5.397989,43.247468
2019-140957,2019-01-17,000001,Vente,134350,83,,BD DU REDON,7795,13009,13209,Marseille 9e Arrondissement,13,,,132098500D0238,,,275,57.8,330,,,,,,,,2,2,Appartement,65,3,,,,,,5.426145,43.251494