id_mutation,date_mutation,numero_disposition,nature_mutation,valeur_fonciere,adresse_numero,adresse_suffixe,adresse_nom_voie,adresse_code_voie,code_postal,code_commune,nom_commune,code_departement,ancien_code_commune,ancien_nom_commune,id_parcelle,ancien_id_parcelle,numero_volume,lot1_numero,lot1_surface_carrez,lot2_numero,lot2_surface_carrez,lot3_numero,lot3_surface_carrez,lot4_numero,lot4_surface_carrez,lot5_numero,lot5_surface_carrez,nombre_lots,code_type_local,type_local,surface_reelle_bati,nombre_pieces_principales,code_nature_culture,nature_culture,code_nature_culture_speciale,nature_culture_speciale,surface_terrain,longitude,latitude
2019-173189,2019-01-19,000001,Vente,155000,,,LES BRUYERES,B003,14700,14025,Aubigny,14,,,14025000ZC0060,,,,,,,,,,,,,0,,,,,S,sols,,,3,-0.225523,48.913161
2019-173189,2019-01-19,000001,Vente,155000,1,,CHE DE LA BASCULE,0006,14700,14025,Aubigny,14,,,14025000ZC0061,,,,,,,,,,,,,0,1,Maison,69,3,J,jardins,,,618,-0.225495,48.913026
2019-173189,2019-01-19,000001,Vente,155000,1,,CHE DE LA BASCULE,0006,14700,14025,Aubigny,14,,,14025000ZC0061,,,,,,,,,,,,,0,1,Maison,69,3,P,prés,,,2300,-0.225495,48.913026
2019-173328,2019-01-22,000001,Vente,250000,29,,RUE DE CAEN,0007,14700,14025,Aubigny,14,,,14025000ZE0039,,,,,,,,,,,,,0,1,Maison,170,5,J,jardins,,,1000,-0.213622,48.926563
2019-173328,2019-01-22,000001,Vente,250000,29,,RUE DE CAEN,0007,14700,14025,Aubigny,14,,,14025000ZE0039,,,,,,,,,,,,,0,1,Maison,170,5,S,sols,,,720,-0.213622,48.926563
2019-173328,2019-01-22,000001,Vente,250000,29,,RUE DE CAEN,0007,14700,14025,Aubigny,14,,,14025000ZE0040,,,,,,,,,,,,,0,,,,,S,sols,,,183,-0.214121,48.926334
2019-174619,2019-04-05,000001,Vente,258500,2,,CHE DE L'ORMEAU DES GRELES,0019,14700,14025,Aubigny,14,,,14025000ZL0046,,,,,,,,,,,,,0,1,Maison,170,6,J,jardins,,,1890,-0.211559,48.917699
2019-174619,2019-04-05,000001,Vente,258500,2,,CHE DE L'ORMEAU DES GRELES,0019,14700,14025,Aubigny,14,,,14025000ZL0046,,,,,,,,,,,,,0,1,Maison,170,6,S,sols,,,600,-0.211559,48.917699
2019-174976,2019-05-04,000001,Vente,231500,5015,,LE PUITS,B027,14700,14025,Aubigny,14,,,14025000ZL0003,,,,,,,,,,,,,0,1,Maison,97,4,S,sols,,,385,-0.217095,48.919196
