id_mutation,date_mutation,numero_disposition,nature_mutation,valeur_fonciere,adresse_numero,adresse_suffixe,adresse_nom_voie,adresse_code_voie,code_postal,code_commune,nom_commune,code_departement,ancien_code_commune,ancien_nom_commune,id_parcelle,ancien_id_parcelle,numero_volume,lot1_numero,lot1_surface_carrez,lot2_numero,lot2_surface_carrez,lot3_numero,lot3_surface_carrez,lot4_numero,lot4_surface_carrez,lot5_numero,lot5_surface_carrez,nombre_lots,code_type_local,type_local,surface_reelle_bati,nombre_pieces_principales,code_nature_culture,nature_culture,code_nature_culture_speciale,nature_culture_speciale,surface_terrain,longitude,latitude
2019-186676,2019-04-04,000001,Vente,62000,65,,RTE DE FAUGUERNON RD 263,0205,14100,14540,Rocques,14,,,145400000A0175,,,,,,,,,,,,,0,4,Local industriel. commercial ou assimilé,234,0,S,sols,,,150,0.244353,49.171496
2019-186676,2019-04-04,000001,Vente,62000,65,,RTE DE FAUGUERNON RD 263,0205,14100,14540,Rocques,14,,,145400000A0175,,,,,,,,,,,,,0,1,Maison,16,1,S,sols,,,150,0.244353,49.171496
2019-186676,2019-04-04,000001,Vente,62000,,,L EGLISE,B090,14100,14540,Rocques,14,,,145400000A0218,,,,,,,,,,,,,0,,,,,S,sols,,,9,0.244293,49.171478
2019-186676,2019-04-04,000001,Vente,62000,,,L EGLISE,B090,14100,14540,Rocques,14,,,145400000A0220,,,,,,,,,,,,,0,,,,,S,sols,,,546,0.244267,49.171528
2019-186907,2019-05-16,000001,Vente,180000,1156,,CHE DU CALVAIRE,0214,14100,14540,Rocques,14,,,145400000B0525,,,,,,,,,,,,,0,1,Maison,130,4,S,sols,,,500,0.260007,49.172405
2019-186907,2019-05-16,000001,Vente,180000,1156,,CHE DU CALVAIRE,0214,14100,14540,Rocques,14,,,145400000B0525,,,,,,,,,,,,,0,1,Maison,130,4,P,prés,,,3016,0.260007,49.172405
2019-186907,2019-05-16,000001,Vente,180000,1156,,CHE DU CALVAIRE,0214,14100,14540,Rocques,14,,,145400000B0525,,,,,,,,,,,,,0,1,Maison,130,4,AG,terrains d'agrément,,,2000,0.260007,49.172405
2019-186907,2019-05-16,000001,Vente,180000,,,CHE DU CALVAIRE,0214,14100,14540,Rocques,14,,,145400000B0528,,,,,,,,,,,,,0,,,,,S,sols,,,388,0.259358,49.171939
2019-187125,2019-07-19,000001,Vente,20000,,,BOIS DE ROCQUES,B016,14100,14540,Rocques,14,,,145400000C0148,,,,,,,,,,,,,0,,,,,S,sols,,,1272,0.238114,49.161946
2019-187126,2019-07-19,000002,Vente,530000,67,,CHE DE LA HETRAIE,0206,14100,14540,Rocques,14,,,145400000C0149,,,,,,,,,,,,,0,1,Maison,167,7,S,sols,,,1815,0.238834,49.162146
2019-187126,2019-07-19,000002,Vente,530000,67,,CHE DE LA HETRAIE,0206,14100,14540,Rocques,14,,,145400000C0149,,,,,,,,,,,,,0,1,Maison,167,7,P,prés,,,1393,0.238834,49.162146
2019-187126,2019-07-19,000002,Vente,530000,67,,CHE DE LA HETRAIE,0206,14100,14540,Rocques,14,,,145400000C0149,,,,,,,,,,,,,0,1,Maison,167,7,AG,terrains d'agrément,,,3470,0.238834,49.162146
2019-187914,2019-12-20,000001,Vente,205000,559,,RTE DE FAUGUERNON RD 263,0205,14100,14540,Rocques,14,,,145400000B0255,,,,,,,,,,,,,0,1,Maison,103,4,S,sols,,,800,0.246599,49.17486
2019-187914,2019-12-20,000001,Vente,205000,559,,RTE DE FAUGUERNON RD 263,0205,14100,14540,Rocques,14,,,145400000B0255,,,,,,,,,,,,,0,1,Maison,103,4,AG,terrains d'agrément,,,8000,0.246599,49.17486
