id_mutation,date_mutation,numero_disposition,nature_mutation,valeur_fonciere,adresse_numero,adresse_suffixe,adresse_nom_voie,adresse_code_voie,code_postal,code_commune,nom_commune,code_departement,ancien_code_commune,ancien_nom_commune,id_parcelle,ancien_id_parcelle,numero_volume,lot1_numero,lot1_surface_carrez,lot2_numero,lot2_surface_carrez,lot3_numero,lot3_surface_carrez,lot4_numero,lot4_surface_carrez,lot5_numero,lot5_surface_carrez,nombre_lots,code_type_local,type_local,surface_reelle_bati,nombre_pieces_principales,code_nature_culture,nature_culture,code_nature_culture_speciale,nature_culture_speciale,surface_terrain,longitude,latitude
2019-184828,2019-03-19,000001,Vente,152000,5064,,CLOS MARICORNE,B045,14710,14622,Saint-Martin-de-Blagny,14,,,146220000A0222,,,,,,,,,,,,,0,1,Maison,150,7,J,jardins,,,1075,-0.917387,49.269317
2019-184828,2019-03-19,000001,Vente,152000,5064,,CLOS MARICORNE,B045,14710,14622,Saint-Martin-de-Blagny,14,,,146220000A0222,,,,,,,,,,,,,0,1,Maison,150,7,S,sols,,,500,-0.917387,49.269317
2019-185050,2019-04-11,000002,Vente,100000,,,LA CHAUSSEE,B027,14710,14622,Saint-Martin-de-Blagny,14,,,146220000B0043,,,,,,,,,,,,,0,,,,,P,prés,,,2050,-0.933016,49.260151
2019-185050,2019-04-11,000002,Vente,100000,,,LA CHAUSSEE,B027,14710,14622,Saint-Martin-de-Blagny,14,,,146220000B0044,,,,,,,,,,,,,0,,,,,J,jardins,,,810,-0.932584,49.259878
2019-185050,2019-04-11,000002,Vente,100000,5039,,LA CHAUSSEE,B027,14710,14622,Saint-Martin-de-Blagny,14,,,146220000B0045,,,,,,,,,,,,,0,1,Maison,118,5,S,sols,,,3800,-0.932849,49.259584
2019-185050,2019-04-11,000002,Vente,100000,,,LA CHAUSSEE,B027,14710,14622,Saint-Martin-de-Blagny,14,,,146220000B0046,,,,,,,,,,,,,0,,,,,P,prés,,,1800,-0.933166,49.259055
2019-185050,2019-04-11,000002,Vente,100000,,,PIECE DE LA CHAUSSEE,B189,14710,14622,Saint-Martin-de-Blagny,14,,,146220000B0253,,,,,,,,,,,,,0,,,,,P,prés,,,848,-0.932647,49.259538
2019-185511,2019-08-09,000001,Vente,152000,,,PRE DU LIEU DE GUERRE,B242,14710,14622,Saint-Martin-de-Blagny,14,,,146220000B0136,,,,,,,,,,,,,0,,,,,P,prés,,,17110,-0.955889,49.25257
2019-185511,2019-08-09,000001,Vente,152000,,,L ENTRETENANT,B066,14710,14622,Saint-Martin-de-Blagny,14,,,146220000B0188,,,,,,,,,,,,,0,,,,,P,prés,,,12650,-0.953603,49.252257
2019-185511,2019-08-09,000001,Vente,152000,,,PIECE DE L ENTREE,B187,14710,14622,Saint-Martin-de-Blagny,14,,,146220000B0189,,,,,,,,,,,,,0,,,,,P,prés,,,6000,-0.95364,49.251749
2019-185511,2019-08-09,000001,Vente,152000,5019,,LIEU DE GUERRE,B138,14710,14622,Saint-Martin-de-Blagny,14,,,146220000B0196,,,,,,,,,,,,,0,1,Maison,110,3,S,sols,,,1280,-0.954645,49.251712
2019-185511,2019-08-09,000001,Vente,152000,,,LIEU DE GUERRE,B138,14710,14622,Saint-Martin-de-Blagny,14,,,146220000B0197,,,,,,,,,,,,,0,,,,,J,jardins,,,1280,-0.954615,49.251921
2019-185534,2019-07-26,000001,Vente,130000,5034,,LE TAILLIS,B261,14710,14622,Saint-Martin-de-Blagny,14,,,146220000B0093,,,,,,,,,,,,,0,1,Maison,125,6,S,sols,,,1123,-0.935639,49.253761
2019-185534,2019-07-26,000001,Vente,130000,5070,,LE TAILLIS,B261,14710,14622,Saint-Martin-de-Blagny,14,,,146220000B0094,,,,,,,,,,,,,0,3,Dépendance,,0,J,jardins,,,700,-0.935572,49.253566
2019-185534,2019-07-26,000001,Vente,130000,5070,,LE TAILLIS,B261,14710,14622,Saint-Martin-de-Blagny,14,,,146220000B0094,,,,,,,,,,,,,0,3,Dépendance,,0,S,sols,,,100,-0.935572,49.253566
2019-185534,2019-07-26,000001,Vente,130000,,,LE CLOS DU MARAIS,B038,14710,14622,Saint-Martin-de-Blagny,14,,,146220000B0255,,,,,,,,,,,,,0,,,,,AG,terrains d'agrément,,,315,-0.935801,49.252715
2019-185534,2019-07-26,000001,Vente,130000,,,CLOS MARAIS,B044,14710,14622,Saint-Martin-de-Blagny,14,,,146220000B0257,,,,,,,,,,,,,0,,,,,AG,terrains d'agrément,,,6995,-0.935939,49.253432
2019-185716,2019-09-10,000001,Vente,217000,,,LE JARDIN DU BESSOIR,B122,14710,14622,Saint-Martin-de-Blagny,14,,,146220000A0001,,,,,,,,,,,,,0,,,,,P,prés,,,14931,-0.937872,49.245383
2019-185716,2019-09-10,000001,Vente,217000,,,LE JARDIN DU BESSOIR,B122,14710,14622,Saint-Martin-de-Blagny,14,,,146220000A0001,,,,,,,,,,,,,0,,,,,P,prés,,,14931,-0.937872,49.245383
2019-185716,2019-09-10,000001,Vente,217000,,,LES GRANDES PIECES,B089,14710,14622,Saint-Martin-de-Blagny,14,,,146220000B0104,,,,,,,,,,,,,0,,,,,P,prés,,,12990,-0.936241,49.250737
2019-185716,2019-09-10,000001,Vente,217000,,,LES GRANDES PIECES,B089,14710,14622,Saint-Martin-de-Blagny,14,,,146220000B0109,,,,,,,,,,,,,0,,,,,P,prés,,,31150,-0.937503,49.249342
2019-185716,2019-09-10,000001,Vente,217000,,,LES ECHANGES,B064,14710,14622,Saint-Martin-de-Blagny,14,,,146220000B0112,,,,,,,,,,,,,0,,,,,P,prés,,,30240,-0.939877,49.249243
2019-185716,2019-09-10,000001,Vente,217000,,,FATOUVILLE,B069,14710,14622,Saint-Martin-de-Blagny,14,,,146220000B0113,,,,,,,,,,,,,0,,,,,P,prés,,,23555,-0.94323,49.248609
2019-185716,2019-09-10,000001,Vente,217000,,,FATOUVILLE,B069,14710,14622,Saint-Martin-de-Blagny,14,,,146220000B0114,,,,,,,,,,,,,0,,,,,S,sols,,,1000,-0.942534,49.248533
2019-185716,2019-09-10,000001,Vente,217000,,,CHAMP CULO,B025,14710,14622,Saint-Martin-de-Blagny,14,,,146220000B0117,,,,,,,,,,,,,0,,,,,P,prés,,,40600,-0.937863,49.247347
2019-185716,2019-09-10,000001,Vente,217000,,,L,B131,14710,14622,Saint-Martin-de-Blagny,14,,,146220000C0017,,,,,,,,,,,,,0,,,,,P,prés,,,17685,-0.96026,49.236269
2019-185716,2019-09-10,000001,Vente,217000,,,L,B131,14710,14622,Saint-Martin-de-Blagny,14,,,146220000C0017,,,,,,,,,,,,,0,,,,,P,prés,,,17685,-0.96026,49.236269
2019-185716,2019-09-10,000001,Vente,217000,,,LA COQUERIE,B054,14710,14622,Saint-Martin-de-Blagny,14,,,146220000C0223,,,,,,,,,,,,,0,,,,,P,prés,,,3345,-0.939716,49.245382
2019-185716,2019-09-10,000001,Vente,217000,,,LA COQUERIE,B054,14710,14622,Saint-Martin-de-Blagny,14,,,146220000C0224,,,,,,,,,,,,,0,,,,,P,prés,,,8930,-0.939787,49.244526
2019-185716,2019-09-10,000001,Vente,217000,,,LES LANDES,B134,14710,14622,Saint-Martin-de-Blagny,14,,,146220000C0227,,,,,,,,,,,,,0,,,,,P,prés,,,8470,-0.941346,49.241996
2019-185716,2019-09-10,000001,Vente,217000,5026,,LA COQUERIE,B054,14710,14622,Saint-Martin-de-Blagny,14,,,146220000C0285,,,,,,,,,,,,,0,1,Maison,106,4,S,sols,,,1146,-0.939358,49.245723
2019-185716,2019-09-10,000001,Vente,217000,5026,,LA COQUERIE,B054,14710,14622,Saint-Martin-de-Blagny,14,,,146220000C0285,,,,,,,,,,,,,0,1,Maison,106,4,J,jardins,,,1181,-0.939358,49.245723
