id_mutation,date_mutation,numero_disposition,nature_mutation,valeur_fonciere,adresse_numero,adresse_suffixe,adresse_nom_voie,adresse_code_voie,code_postal,code_commune,nom_commune,code_departement,ancien_code_commune,ancien_nom_commune,id_parcelle,ancien_id_parcelle,numero_volume,lot1_numero,lot1_surface_carrez,lot2_numero,lot2_surface_carrez,lot3_numero,lot3_surface_carrez,lot4_numero,lot4_surface_carrez,lot5_numero,lot5_surface_carrez,nombre_lots,code_type_local,type_local,surface_reelle_bati,nombre_pieces_principales,code_nature_culture,nature_culture,code_nature_culture_speciale,nature_culture_speciale,surface_terrain,longitude,latitude
2019-195458,2019-08-01,000001,Vente,53000,,,PRADEL,B108,15300,15102,Lavigerie,15,,,15102000AB0199,,,,,,,,,,,,,0,,,,,J,jardins,,,303,2.744415,45.137902
2019-195458,2019-08-01,000001,Vente,53000,,,LE BOURG,B013,15300,15102,Lavigerie,15,,,15102000AC0006,,,,,,,,,,,,,0,,,,,J,jardins,,,51,2.744355,45.138076
2019-195458,2019-08-01,000001,Vente,53000,,,LE BOURG,B013,15300,15102,Lavigerie,15,,,15102000AC0016,,,,,,,,,,,,,0,,,,,S,sols,,,61,2.744328,45.138186
2019-195458,2019-08-01,000001,Vente,53000,,,LE BOURG,B013,15300,15102,Lavigerie,15,,,15102000AC0017,,,,,,,,,,,,,0,,,,,J,jardins,,,68,2.744228,45.138181
2019-195458,2019-08-01,000001,Vente,53000,5030,,LE BOURG,B013,15300,15102,Lavigerie,15,,,15102000AC0020,,,,,,,,,,,,,0,1,Maison,53,1,S,sols,,,25,2.744135,45.138284
2019-195688,2019-08-22,000001,Vente,50000,5057,,LA GANDILHON,B064,15300,15102,Lavigerie,15,,,15102000AB0092,,,,,,,,,,,,,0,1,Maison,32,2,S,sols,,,775,2.734717,45.136614
2019-195688,2019-08-22,000001,Vente,50000,,,LA GANDILHON,B064,15300,15102,Lavigerie,15,,,15102000AB0340,,,,,,,,,,,,,0,,,,,P,prés,,,2587,2.735079,45.137134
2019-195688,2019-08-22,000001,Vente,50000,,,LA GANDILHON,B064,15300,15102,Lavigerie,15,,,15102000AB0341,,,,,,,,,,,,,0,,,,,P,prés,,,2389,2.735417,45.136501
2019-195688,2019-08-22,000001,Vente,50000,,,LA GANDILHON,B064,15300,15102,Lavigerie,15,,,15102000AB0342,,,,,,,,,,,,,0,,,,,P,prés,,,198,2.735343,45.136408
2019-195688,2019-08-22,000001,Vente,50000,,,LA GANDILHON,B064,15300,15102,Lavigerie,15,,,15102000AB0343,,,,,,,,,,,,,0,,,,,P,prés,,,1234,2.734747,45.136725
2019-195688,2019-08-22,000001,Vente,50000,,,LA GANDILHON,B064,15300,15102,Lavigerie,15,,,15102000AB0344,,,,,,,,,,,,,0,,,,,P,prés,,,117,2.734876,45.136493
2019-195714,2019-08-22,000001,Vente,66000,,,LA BUGE,B015,15300,15102,Lavigerie,15,,,15102000AD0038,,,,,,,,,,,,,0,,,,,L,landes,,,265,2.758285,45.141906
2019-195714,2019-08-22,000001,Vente,66000,5007,,LA BUGE,B015,15300,15102,Lavigerie,15,,,15102000AD0045,,,,,,,,,,,,,0,1,Maison,78,4,S,sols,,,80,2.758462,45.141878
2019-195714,2019-08-22,000001,Vente,66000,,,LA BUGE,B015,15300,15102,Lavigerie,15,,,15102000AD0211,,,,,,,,,,,,,0,,,,,J,jardins,,,108,2.758415,45.142048
2019-195714,2019-08-22,000001,Vente,66000,,,LA BUGE,B015,15300,15102,Lavigerie,15,,,15102000AD0212,,,,,,,,,,,,,0,,,,,J,jardins,,,240,2.758561,45.142075
2019-197045,2019-12-30,000001,Vente,1680,,,LA GANDILHON,B064,15300,15102,Lavigerie,15,,,15102000AB0080,,,,,,,,,,,,,0,,,,,J,jardins,,,283,2.734745,45.136263
