id_mutation,date_mutation,numero_disposition,nature_mutation,valeur_fonciere,adresse_numero,adresse_suffixe,adresse_nom_voie,adresse_code_voie,code_postal,code_commune,nom_commune,code_departement,ancien_code_commune,ancien_nom_commune,id_parcelle,ancien_id_parcelle,numero_volume,lot1_numero,lot1_surface_carrez,lot2_numero,lot2_surface_carrez,lot3_numero,lot3_surface_carrez,lot4_numero,lot4_surface_carrez,lot5_numero,lot5_surface_carrez,nombre_lots,code_type_local,type_local,surface_reelle_bati,nombre_pieces_principales,code_nature_culture,nature_culture,code_nature_culture_speciale,nature_culture_speciale,surface_terrain,longitude,latitude
2019-197205,2019-01-14,000001,Vente,2000,,,CROIX DE FESSOU,B031,16170,16123,Échallat,16,,,161230000B0927,,,,,,,,,,,,,0,,,,,S,sols,,,3037,-0.026286,45.721972
2019-197660,2019-02-08,000002,Echange,47099.4,,,LES PETITES FOSSES DE L HA,B064,16170,16123,Échallat,16,,,161230000C0032,,,,,,,,,,,,,0,,,,,VI,vignes,VAOC,Vins d'appellation d'origine contrôlée,2320,-0.032494,45.700906
2019-197660,2019-02-08,000002,Echange,47099.4,,,LES PETITES FOSSES DE L HA,B064,16170,16123,Échallat,16,,,161230000C0035,,,,,,,,,,,,,0,,,,,VI,vignes,VAOC,Vins d'appellation d'origine contrôlée,4130,-0.031821,45.702493
2019-197660,2019-02-08,000002,Echange,47099.4,,,LES PETITES FOSSES DE L HA,B064,16170,16123,Échallat,16,,,161230000C0043,,,,,,,,,,,,,0,,,,,T,terres,,,1900,-0.032804,45.701678
2019-197660,2019-02-08,000002,Echange,47099.4,,,LES PETITES FOSSES DE L HA,B064,16170,16123,Échallat,16,,,161230000C0044,,,,,,,,,,,,,0,,,,,VI,vignes,VAOC,Vins d'appellation d'origine contrôlée,1780,-0.033101,45.701612
2019-197660,2019-02-08,000002,Echange,47099.4,,,LES PETITES FOSSES DE L HA,B064,16170,16123,Échallat,16,,,161230000C0046,,,,,,,,,,,,,0,,,,,VI,vignes,VAOC,Vins d'appellation d'origine contrôlée,6380,-0.033343,45.702599
2019-197660,2019-02-08,000002,Echange,47099.4,,,LA GRANDE FOSSE DE L HABIT,B047,16170,16123,Échallat,16,,,161230000C0452,,,,,,,,,,,,,0,,,,,T,terres,,,2692,-0.030774,45.702571
2019-197660,2019-02-08,000002,Echange,47099.4,,,LA GRANDE FOSSE DE L HABIT,B047,16170,16123,Échallat,16,,,161230000C0454,,,,,,,,,,,,,0,,,,,T,terres,,,3105,-0.029519,45.702531
2019-197660,2019-02-08,000002,Echange,47099.4,,,LES PETITES FOSSES DE L HA,B064,16170,16123,Échallat,16,,,161230000C0497,,,,,,,,,,,,,0,,,,,VI,vignes,VAOC,Vins d'appellation d'origine contrôlée,3201,-0.034525,45.69869
2019-197663,2019-02-08,000005,Echange,24422.44,,,LES PETITES FOSSES DE L HA,B064,16170,16123,Échallat,16,,,161230000C0031,,,,,,,,,,,,,0,,,,,T,terres,,,2690,-0.032877,45.700694
2019-197663,2019-02-08,000005,Echange,24422.44,,,LES PETITES FOSSES DE L HA,B064,16170,16123,Échallat,16,,,161230000C0033,,,,,,,,,,,,,0,,,,,T,terres,,,3480,-0.032013,45.701604
2019-197663,2019-02-08,000005,Echange,24422.44,,,LES PETITES FOSSES DE L HA,B064,16170,16123,Échallat,16,,,161230000C0034,,,,,,,,,,,,,0,,,,,T,terres,,,904,-0.032063,45.702111
2019-197663,2019-02-08,000005,Echange,24422.44,,,LES PETITES FOSSES DE L HA,B064,16170,16123,Échallat,16,,,161230000C0034,,,,,,,,,,,,,0,,,,,VI,vignes,VAOC,Vins d'appellation d'origine contrôlée,936,-0.032063,45.702111
2019-197663,2019-02-08,000005,Echange,24422.44,,,LA COMBE DE L ORMEAU,B024,16170,16123,Échallat,16,,,161230000C0425,,,,,,,,,,,,,0,,,,,VI,vignes,VAOC,Vins d'appellation d'origine contrôlée,8420,-0.030814,45.694938
2019-197664,2019-02-08,000006,Echange,27024.4,,,LA FENOUISE,B037,16170,16123,Échallat,16,,,161230000C0280,,,,,,,,,,,,,0,,,,,T,terres,,,1430,-0.037263,45.696719
2019-197664,2019-02-08,000006,Echange,27024.4,,,LA FENOUISE,B037,16170,16123,Échallat,16,,,161230000C0281,,,,,,,,,,,,,0,,,,,T,terres,,,1360,-0.037086,45.69673
2019-197664,2019-02-08,000006,Echange,27024.4,,,LES COUDRES,B028,16170,16123,Échallat,16,,,161230000D0331,,,,,,,,,,,,,0,,,,,BT,taillis simples,,,1030,-0.031524,45.71016
2019-197809,2019-03-05,000001,Vente,160000,,,LES PETITES FOSSES DE L HA,B064,16170,16123,Échallat,16,,,161230000C0019,,,,,,,,,,,,,0,,,,,VI,vignes,VAOC,Vins d'appellation d'origine contrôlée,2915,-0.035199,45.698869
2019-197809,2019-03-05,000001,Vente,160000,,,LE PAS BLANC,B063,16170,16123,Échallat,16,,,161230000C0346,,,,,,,,,,,,,0,,,,,VI,vignes,VAOC,Vins d'appellation d'origine contrôlée,2130,-0.029194,45.693624
2019-197809,2019-03-05,000001,Vente,160000,,,LE PAS BLANC,B063,16170,16123,Échallat,16,,,161230000C0347,,,,,,,,,,,,,0,,,,,VI,vignes,VAOC,Vins d'appellation d'origine contrôlée,5754,-0.029629,45.692802
2019-197809,2019-03-05,000001,Vente,160000,,,LES PETITES FOSSES DE L HA,B064,16170,16123,Échallat,16,,,161230000C0459,,,,,,,,,,,,,0,,,,,T,terres,,,1212,-0.033932,45.704453
2019-197809,2019-03-05,000001,Vente,160000,,,LES PETITES FOSSES DE L HA,B064,16170,16123,Échallat,16,,,161230000C0461,,,,,,,,,,,,,0,,,,,T,terres,,,6138,-0.033697,45.702962
2019-198111,2019-03-22,000001,Vente,123700,5113,,PL DU LAVOIR,0097,16170,16123,Échallat,16,,,161230000B1069,,,,,,,,,,,,,0,1,Maison,90,4,S,sols,,,446,-0.039996,45.723584
2019-198380,2019-04-15,000001,Vente,140000,5211,,RTE DE CHANTE A GRE,0030,16170,16123,Échallat,16,,,161230000D1006,,,,,,,,,,,,,0,1,Maison,113,6,J,jardins,,,969,-0.038637,45.720944
2019-198380,2019-04-15,000001,Vente,140000,5211,,RTE DE CHANTE A GRE,0030,16170,16123,Échallat,16,,,161230000D1006,,,,,,,,,,,,,0,1,Maison,113,6,S,sols,,,500,-0.038637,45.720944
2019-198616,2019-05-06,000001,Echange,20000,,,LE PAS BLANC,B063,16170,16123,Échallat,16,,,161230000C0168,,,,,,,,,,,,,0,,,,,T,terres,,,4140,-0.024136,45.693335
2019-198616,2019-05-06,000001,Echange,20000,,,LE PAS BLANC,B063,16170,16123,Échallat,16,,,161230000C0499,,,,,,,,,,,,,0,,,,,T,terres,,,6198,-0.024796,45.693394
2019-198801,2019-06-04,000001,Vente,135500,5225,,LES CROIZETTES D ETANDEUIL,B032,16170,16123,Échallat,16,,,161230000B1167,,,,,,,,,,,,,0,1,Maison,108,4,S,sols,,,1200,-0.032228,45.72249
2019-198801,2019-06-04,000001,Vente,135500,,,LES CROIZETTES D ETANDEUIL,B032,16170,16123,Échallat,16,,,161230000B1171,,,,,,,,,,,,,0,,,,,S,sols,,,82,-0.03242,45.722613
2019-198857,2019-05-27,000001,Vente,148000,5261,,DERRIERE LE BOIS,B033,16170,16123,Échallat,16,,,161230000B1317,,,,,,,,,,,,,0,1,Maison,126,4,AG,terrains d'agrément,,,731,-0.024105,45.718463
2019-198857,2019-05-27,000001,Vente,148000,5261,,DERRIERE LE BOIS,B033,16170,16123,Échallat,16,,,161230000B1317,,,,,,,,,,,,,0,1,Maison,126,4,S,sols,,,500,-0.024105,45.718463
2019-199447,2019-07-11,000001,Vente,210000,,,LE BOURG,B008,16170,16123,Échallat,16,,,161230000D0033,,,,,,,,,,,,,0,,,,,S,sols,,,481,-0.040301,45.721902
2019-199447,2019-07-11,000001,Vente,210000,,,LE BOURG,B008,16170,16123,Échallat,16,,,161230000D0033,,,,,,,,,,,,,0,,,,,P,prés,,,1559,-0.040301,45.721902
2019-199447,2019-07-11,000001,Vente,210000,,,LE BOURG,B008,16170,16123,Échallat,16,,,161230000D0875,,,,,,,,,,,,,0,,,,,P,prés,,,145,-0.040478,45.721902
2019-199447,2019-07-11,000001,Vente,210000,,,LE BOURG,B008,16170,16123,Échallat,16,,,161230000D0945,,,,,,,,,,,,,0,,,,,S,sols,,,1320,-0.040091,45.721533
2019-199447,2019-07-11,000001,Vente,210000,5138,,RUE DES PASSEROSES,0122,16170,16123,Échallat,16,,,161230000D1146,,,,,,,,,,,,,0,4,Local industriel. commercial ou assimilé,340,0,S,sols,,,258,-0.040785,45.721843
2019-200168,2019-09-05,000001,Vente,172000,,,LE BOIS CLAIR,B002,16170,16123,Échallat,16,,,161230000B0244,,,,,,,,,,,,,0,,,,,VI,vignes,VAOC,Vins d'appellation d'origine contrôlée,1570,-0.022819,45.722656
2019-200168,2019-09-05,000001,Vente,172000,,,LE BOIS CLAIR,B002,16170,16123,Échallat,16,,,161230000B0245,,,,,,,,,,,,,0,,,,,VI,vignes,VAOC,Vins d'appellation d'origine contrôlée,1850,-0.023148,45.722836
2019-200168,2019-09-05,000001,Vente,172000,,,LE BOIS CLAIR,B002,16170,16123,Échallat,16,,,161230000B1019,,,,,,,,,,,,,0,,,,,VI,vignes,VAOC,Vins d'appellation d'origine contrôlée,7400,-0.022045,45.723142
2019-200168,2019-09-05,000001,Vente,172000,,,LE BOIS CLAIR,B002,16170,16123,Échallat,16,,,161230000B1020,,,,,,,,,,,,,0,,,,,VI,vignes,VAOC,Vins d'appellation d'origine contrôlée,6870,-0.022525,45.722831
2019-200265,2019-09-05,000001,Echange,3653,,,LA FRERIE,B041,16170,16123,Échallat,16,,,161230000B0536,,,,,,,,,,,,,0,,,,,VI,vignes,VAOC,Vins d'appellation d'origine contrôlée,3185,-0.026994,45.72804
2019-200265,2019-09-05,000001,Echange,3653,,,LA FRERIE,B041,16170,16123,Échallat,16,,,161230000B1148,,,,,,,,,,,,,0,,,,,T,terres,,,1566,-0.028198,45.728736
2019-200265,2019-09-05,000001,Echange,3653,,,LA FRERIE,B041,16170,16123,Échallat,16,,,161230000B1150,,,,,,,,,,,,,0,,,,,VI,vignes,VAOC,Vins d'appellation d'origine contrôlée,2025,-0.027951,45.728757
2019-200265,2019-09-05,000001,Echange,3653,,,LA FRERIE,B041,16170,16123,Échallat,16,,,161230000B1153,,,,,,,,,,,,,0,,,,,T,terres,,,347,-0.026779,45.728091
2019-200265,2019-09-05,000002,Echange,3653,,,LA MARE ET CHEMIN DE NIGRO,B056,16170,16123,Échallat,16,,,161230000B0165,,,,,,,,,,,,,0,,,,,T,terres,,,3045,-0.016028,45.726023
2019-200265,2019-09-05,000002,Echange,3653,,,LA MARE ET CHEMIN DE NIGRO,B056,16170,16123,Échallat,16,,,161230000B0166,,,,,,,,,,,,,0,,,,,T,terres,,,430,-0.016552,45.725501
2019-200265,2019-09-05,000002,Echange,3653,,,LE BOIS MARTIN,B007,16170,16123,Échallat,16,,,161230000B0740,,,,,,,,,,,,,0,,,,,T,terres,,,2430,-0.016412,45.723059
2019-200265,2019-09-05,000002,Echange,3653,,,LA MARE ET CHEMIN DE NIGRO,B056,16170,16123,Échallat,16,,,161230000B0917,,,,,,,,,,,,,0,,,,,T,terres,,,1585,-0.016124,45.725687
2019-200267,2019-09-05,000002,Echange,20632,,,LE BOIS CLAIR D ETANDEUIL,B003,16170,16123,Échallat,16,,,161230000B0298,,,,,,,,,,,,,0,,,,,T,terres,,,4407,-0.025935,45.725066
2019-200267,2019-09-05,000002,Echange,20632,,,LE BOIS CLAIR D ETANDEUIL,B003,16170,16123,Échallat,16,,,161230000B0298,,,,,,,,,,,,,0,,,,,T,terres,,,2203,-0.025935,45.725066
2019-200267,2019-09-05,000002,Echange,20632,,,L HUTTE ET L OUCHE DU CRAP,B053,16170,16123,Échallat,16,,,161230000B0345,,,,,,,,,,,,,0,,,,,T,terres,,,3460,-0.031088,45.725934
2019-200267,2019-09-05,000002,Echange,20632,,,LA FRERIE,B041,16170,16123,Échallat,16,,,161230000B0536,,,,,,,,,,,,,0,,,,,VI,vignes,VAOC,Vins d'appellation d'origine contrôlée,3185,-0.026994,45.72804
2019-200267,2019-09-05,000002,Echange,20632,,,LA FRERIE,B041,16170,16123,Échallat,16,,,161230000B1148,,,,,,,,,,,,,0,,,,,T,terres,,,1566,-0.028198,45.728736
2019-200267,2019-09-05,000002,Echange,20632,,,LA FRERIE,B041,16170,16123,Échallat,16,,,161230000B1150,,,,,,,,,,,,,0,,,,,VI,vignes,VAOC,Vins d'appellation d'origine contrôlée,2025,-0.027951,45.728757
2019-200267,2019-09-05,000002,Echange,20632,,,LA FRERIE,B041,16170,16123,Échallat,16,,,161230000B1153,,,,,,,,,,,,,0,,,,,T,terres,,,347,-0.026779,45.728091
2019-200268,2019-09-05,000003,Echange,22334,,,LE BOIS CLAIR D ETANDEUIL,B003,16170,16123,Échallat,16,,,161230000B0250,,,,,,,,,,,,,0,,,,,T,terres,,,3880,-0.023398,45.723283
2019-200268,2019-09-05,000003,Echange,22334,,,LE BOIS CLAIR D ETANDEUIL,B003,16170,16123,Échallat,16,,,161230000B0254,,,,,,,,,,,,,0,,,,,T,terres,,,4200,-0.026056,45.723373
2019-200313,2019-09-13,000001,Vente,14000,,,LE BOURG,B008,16170,16123,Échallat,16,,,161230000D1139,,,,,,,,,,,,,0,,,,,T,terres,,,1019,-0.038564,45.721413
2019-200566,2019-09-26,000001,Vente,6933.6,,,DERRIERE LE BOIS,B033,16170,16123,Échallat,16,,,161230000B1338,,,,,,,,,,,,,0,,,,,L,landes,,,200,-0.024705,45.715714
2019-200566,2019-09-26,000001,Vente,6933.6,,,DERRIERE LE BOIS,B033,16170,16123,Échallat,16,,,161230000B1340,,,,,,,,,,,,,0,,,,,VI,vignes,VAOC,Vins d'appellation d'origine contrôlée,1234,-0.025085,45.71586
2019-200566,2019-09-26,000001,Vente,6933.6,,,DERRIERE LE BOIS,B033,16170,16123,Échallat,16,,,161230000B1345,,,,,,,,,,,,,0,,,,,T,terres,,,2300,-0.024821,45.715871
2019-200566,2019-09-26,000001,Vente,6933.6,,,DERRIERE LE BOIS,B033,16170,16123,Échallat,16,,,161230000B1350,,,,,,,,,,,,,0,,,,,T,terres,,,4958,-0.025517,45.715895
2019-200566,2019-09-26,000001,Vente,6933.6,,,DERRIERE LE BOIS,B033,16170,16123,Échallat,16,,,161230000B1354,,,,,,,,,,,,,0,,,,,T,terres,,,8642,-0.026492,45.714839
2019-200707,2019-10-17,000001,Vente,183060,,,LE GRAND PRE,B046,16170,16123,Échallat,16,,,161230000A0983,,,,,,,,,,,,,0,,,,,S,sols,,,397,-0.040751,45.726152
2019-200707,2019-10-17,000001,Vente,183060,,,LE GRAND PRE,B046,16170,16123,Échallat,16,,,161230000A0985,,,,,,,,,,,,,0,,,,,S,sols,,,380,-0.040681,45.726044
2019-200707,2019-10-17,000001,Vente,183060,5249,,CHE DE LA POSTE,0126,16170,16123,Échallat,16,,,161230000A0987,,,,,,,,,,,,,0,1,Maison,160,6,S,sols,,,1000,-0.040829,45.725913
2019-200707,2019-10-17,000001,Vente,183060,5249,,CHE DE LA POSTE,0126,16170,16123,Échallat,16,,,161230000A0987,,,,,,,,,,,,,0,1,Maison,160,6,AG,terrains d'agrément,,,448,-0.040829,45.725913
2019-200707,2019-10-17,000001,Vente,183060,,,LE GRAND PRE,B046,16170,16123,Échallat,16,,,161230000A0989,,,,,,,,,,,,,0,,,,,T,terres,,,573,-0.039814,45.725215
2019-200714,2019-10-16,000002,Vente,1084,,,LES GAGNAUDS,B042,16170,16123,Échallat,16,,,161230000B1418,,,,,,,,,,,,,0,,,,,VI,vignes,VAOC,Vins d'appellation d'origine contrôlée,523,-0.024344,45.729149
2019-200714,2019-10-16,000002,Vente,1084,,,LES GAGNAUDS,B042,16170,16123,Échallat,16,,,161230000B1420,,,,,,,,,,,,,0,,,,,VI,vignes,VAOC,Vins d'appellation d'origine contrôlée,561,-0.024524,45.729066
2019-200983,2019-10-31,000001,Vente,5000,,,LE BOURG,B008,16170,16123,Échallat,16,,,161230000D1152,,,,,,,,,,,,,0,,,,,T,terres,,,841,-0.038495,45.72168
2019-201096,2019-11-25,000001,Vente,81673,,,LE BOIS MARTIN,B007,16170,16123,Échallat,16,,,161230000B0691,,,,,,,,,,,,,0,,,,,VI,vignes,VAOC,Vins d'appellation d'origine contrôlée,1800,-0.021588,45.720295
2019-201096,2019-11-25,000001,Vente,81673,,,LE BOIS MARTIN,B007,16170,16123,Échallat,16,,,161230000B0695,,,,,,,,,,,,,0,,,,,T,terres,,,590,-0.021757,45.721545
2019-201096,2019-11-25,000001,Vente,81673,,,LE BOIS MARTIN,B007,16170,16123,Échallat,16,,,161230000B0696,,,,,,,,,,,,,0,,,,,T,terres,,,590,-0.021775,45.721695
2019-201096,2019-11-25,000001,Vente,81673,,,LE BOIS MARTIN,B007,16170,16123,Échallat,16,,,161230000B0700,,,,,,,,,,,,,0,,,,,T,terres,,,8400,-0.021104,45.720987
2019-201096,2019-11-25,000001,Vente,81673,,,LE BOIS MARTIN,B007,16170,16123,Échallat,16,,,161230000B0701,,,,,,,,,,,,,0,,,,,VI,vignes,VAOC,Vins d'appellation d'origine contrôlée,1780,-0.021443,45.720534
2019-201096,2019-11-25,000001,Vente,81673,,,LE BOIS MARTIN,B007,16170,16123,Échallat,16,,,161230000B0702,,,,,,,,,,,,,0,,,,,T,terres,,,3200,-0.020476,45.719929
2019-201096,2019-11-25,000001,Vente,81673,,,LE BOIS MARTIN,B007,16170,16123,Échallat,16,,,161230000B0702,,,,,,,,,,,,,0,,,,,VI,vignes,VAOC,Vins d'appellation d'origine contrôlée,290,-0.020476,45.719929
2019-201731,2019-12-27,000001,Vente,106150,5153,,RUE DES PASSEROSES,0122,16170,16123,Échallat,16,,,161230000D0944,,,,,,,,,,,,,0,1,Maison,120,4,J,jardins,,,418,-0.040209,45.721435
2019-201731,2019-12-27,000001,Vente,106150,5153,,RUE DES PASSEROSES,0122,16170,16123,Échallat,16,,,161230000D0944,,,,,,,,,,,,,0,1,Maison,120,4,S,sols,,,212,-0.040209,45.721435
2019-201731,2019-12-27,000001,Vente,106150,,,LE BOURG,B008,16170,16123,Échallat,16,,,161230000D0946,,,,,,,,,,,,,0,,,,,S,sols,,,530,-0.040459,45.72142
