id_mutation,date_mutation,numero_disposition,nature_mutation,valeur_fonciere,adresse_numero,adresse_suffixe,adresse_nom_voie,adresse_code_voie,code_postal,code_commune,nom_commune,code_departement,ancien_code_commune,ancien_nom_commune,id_parcelle,ancien_id_parcelle,numero_volume,lot1_numero,lot1_surface_carrez,lot2_numero,lot2_surface_carrez,lot3_numero,lot3_surface_carrez,lot4_numero,lot4_surface_carrez,lot5_numero,lot5_surface_carrez,nombre_lots,code_type_local,type_local,surface_reelle_bati,nombre_pieces_principales,code_nature_culture,nature_culture,code_nature_culture_speciale,nature_culture_speciale,surface_terrain,longitude,latitude
2019-201845,2019-01-07,000001,Vente,82000,12,,RUE DU PRADEAU,0070,16500,16131,Esse,16,,,161310000B0647,,,,,,,,,,,,,0,1,Maison,117,4,S,sols,,,419,0.721224,46.031037
2019-201855,2019-01-08,000001,Vente,15201,,,AUX CLAPIERS,B044,16500,16131,Esse,16,,,161310000E1732,,,,,,,,,,,,,0,,,,,AB,terrains a bâtir,,,1126,0.716959,46.029748
2019-202277,2019-03-08,000001,Vente,227883,,,LA GRANDE PIECE,B075,16500,16131,Esse,16,,,161310000D1085,,,,,,,,,,,,,0,,,,,T,terres,,,24520,0.719586,46.001188
2019-202277,2019-03-08,000001,Vente,227883,,,LA GRANDE PIECE,B075,16500,16131,Esse,16,,,161310000D1085,,,,,,,,,,,,,0,,,,,T,terres,,,24520,0.719586,46.001188
2019-202277,2019-03-08,000001,Vente,227883,,,LA GRANDE PIECE,B075,16500,16131,Esse,16,,,161310000D1086,,,,,,,,,,,,,0,,,,,P,prés,,,17070,0.720211,46.000149
2019-202277,2019-03-08,000001,Vente,227883,,,LA GRANDE PIECE,B075,16500,16131,Esse,16,,,161310000D1088,,,,,,,,,,,,,0,,,,,T,terres,,,2200,0.717986,45.999979
2019-202278,2019-03-08,000001,Vente,22000,,,LES BESSES,B010,16500,16131,Esse,16,,,161310000D1147,,,,,,,,,,,,,0,,,,,T,terres,,,11830,0.718183,46.009187
2019-202278,2019-03-08,000001,Vente,22000,,,LES BESSES,B010,16500,16131,Esse,16,,,161310000D1147,,,,,,,,,,,,,0,,,,,T,terres,,,11830,0.718183,46.009187
2019-202278,2019-03-08,000001,Vente,22000,,,LA VIEILLE GARCELIE,B165,16500,16131,Esse,16,,,161310000E0599,,,,,,,,,,,,,0,,,,,T,terres,,,2395,0.709214,46.009888
2019-202278,2019-03-08,000001,Vente,22000,,,LA VIEILLE GARCELIE,B165,16500,16131,Esse,16,,,161310000E0599,,,,,,,,,,,,,0,,,,,T,terres,,,2605,0.709214,46.009888
2019-202278,2019-03-08,000001,Vente,22000,,,LA VIEILLE GARCELIE,B165,16500,16131,Esse,16,,,161310000E0605,,,,,,,,,,,,,0,,,,,L,landes,,,24040,0.708681,46.010082
2019-202278,2019-03-08,000001,Vente,22000,,,LA VIEILLE GARCELIE,B165,16500,16131,Esse,16,,,161310000E0606,,,,,,,,,,,,,0,,,,,P,prés,,,18705,0.711482,46.010463
2019-202344,2019-03-22,000001,Vente,2000,,,LE BOURG,B019,16500,16131,Esse,16,,,161310000C0173,,,,,,,,,,,,,0,,,,,J,jardins,,,465,0.721519,46.031464
2019-202361,2019-03-22,000001,Vente,3000,,,LE BOURG,B019,16500,16131,Esse,16,,,161310000C0170,,,,,,,,,,,,,0,,,,,S,sols,,,13,0.721732,46.031842
2019-202723,2019-04-30,000001,Vente,78000,10,,RUE DU PRADEAU,0070,16500,16131,Esse,16,,,161310000B0648,,,,,,,,,,,,,0,1,Maison,78,4,S,sols,,,442,0.721469,46.030966
2019-202777,2019-05-10,000001,Vente,122020,,,LES RECLAUX,B150,16500,16131,Esse,16,,,161310000E0453,,,,,,,,,,,,,0,,,,,BT,taillis simples,,,4030,0.718291,46.01259
2019-202777,2019-05-10,000001,Vente,122020,5317,,LE PAS DE LA MULE,B115,16500,16131,Esse,16,,,161310000E1620,,,,,,,,,,,,,0,3,Dépendance,,0,P,prés,,,29475,0.717046,46.012004
2019-202777,2019-05-10,000001,Vente,122020,5317,,LE PAS DE LA MULE,B115,16500,16131,Esse,16,,,161310000E1620,,,,,,,,,,,,,0,3,Dépendance,,0,S,sols,,,610,0.717046,46.012004
2019-202777,2019-05-10,000001,Vente,122020,5317,,LE PAS DE LA MULE,B115,16500,16131,Esse,16,,,161310000E1620,,,,,,,,,,,,,0,3,Dépendance,,0,E,eaux,ETANG,Etangs,9105,0.717046,46.012004
2019-202988,2019-05-15,000001,Vente,29120,,,LE MAS VIEUX,B107,16500,16131,Esse,16,,,161310000C0090,,,,,,,,,,,,,0,,,,,T,terres,,,5840,0.731985,46.033897
2019-202988,2019-05-15,000001,Vente,29120,,,LE MAS VIEUX,B107,16500,16131,Esse,16,,,161310000C0094,,,,,,,,,,,,,0,,,,,P,prés,,,9070,0.732484,46.032735
2019-202988,2019-05-15,000001,Vente,29120,,,LES GRANDS CHAMPS,B080,16500,16131,Esse,16,,,161310000C0095,,,,,,,,,,,,,0,,,,,T,terres,,,7142,0.731378,46.032472
2019-202988,2019-05-15,000001,Vente,29120,,,LES GRANDS CHAMPS,B080,16500,16131,Esse,16,,,161310000C0095,,,,,,,,,,,,,0,,,,,T,terres,,,7143,0.731378,46.032472
2019-202988,2019-05-15,000001,Vente,29120,,,CHEZ RAUBIT,B040,16500,16131,Esse,16,,,161310000C0708,,,,,,,,,,,,,0,,,,,P,prés,,,1210,0.73464,46.030911
2019-202988,2019-05-15,000001,Vente,29120,,,CHEZ RAUBIT,B040,16500,16131,Esse,16,,,161310000C0708,,,,,,,,,,,,,0,,,,,BP,peupleraies,,,1210,0.73464,46.030911
2019-202988,2019-05-15,000001,Vente,29120,5250,,LE MAROUIN,B104,16500,16131,Esse,16,,,161310000D0044,,,,,,,,,,,,,0,1,Maison,73,3,S,sols,,,660,0.732427,46.028719
2019-202988,2019-05-15,000001,Vente,29120,5250,,LE MAROUIN,B104,16500,16131,Esse,16,,,161310000D0044,,,,,,,,,,,,,0,1,Maison,73,3,J,jardins,,,2570,0.732427,46.028719
2019-202988,2019-05-15,000001,Vente,29120,,,LE MAROUIN,B104,16500,16131,Esse,16,,,161310000D0048,,,,,,,,,,,,,0,,,,,J,jardins,,,195,0.732397,46.028521
2019-202988,2019-05-15,000001,Vente,29120,,,LE MAROUIN,B104,16500,16131,Esse,16,,,161310000D0051,,,,,,,,,,,,,0,,,,,S,sols,,,275,0.733032,46.028557
2019-202988,2019-05-15,000001,Vente,29120,,,LE MAROUIN,B104,16500,16131,Esse,16,,,161310000D0052,,,,,,,,,,,,,0,,,,,S,sols,,,225,0.732977,46.028472
2019-202988,2019-05-15,000001,Vente,29120,,,LE MAROUIN,B104,16500,16131,Esse,16,,,161310000D0056,,,,,,,,,,,,,0,,,,,S,sols,,,183,,
2019-202988,2019-05-15,000001,Vente,29120,,,LES TAIS,B161,16500,16131,Esse,16,,,161310000D0075,,,,,,,,,,,,,0,,,,,E,eaux,ETANG,Etangs,690,0.729979,46.02795
2019-202988,2019-05-15,000001,Vente,29120,,,LES TAIS,B161,16500,16131,Esse,16,,,161310000D0076,,,,,,,,,,,,,0,,,,,BT,taillis simples,,,2900,0.729834,46.027679
2019-202988,2019-05-15,000001,Vente,29120,,,LES TAIS,B161,16500,16131,Esse,16,,,161310000D0077,,,,,,,,,,,,,0,,,,,BT,taillis simples,,,4465,0.73043,46.027094
2019-202988,2019-05-15,000001,Vente,29120,,,LES TAIS,B161,16500,16131,Esse,16,,,161310000D0080,,,,,,,,,,,,,0,,,,,BR,futaies résineuses,,,2050,0.730093,46.026299
2019-202988,2019-05-15,000001,Vente,29120,,,LES TAIS,B161,16500,16131,Esse,16,,,161310000D0081,,,,,,,,,,,,,0,,,,,BR,futaies résineuses,,,1330,0.729758,46.026793
2019-202988,2019-05-15,000001,Vente,29120,,,LES TAIS,B161,16500,16131,Esse,16,,,161310000D0082,,,,,,,,,,,,,0,,,,,BR,futaies résineuses,,,1070,0.729569,46.027092
2019-202988,2019-05-15,000001,Vente,29120,,,LES TAIS,B161,16500,16131,Esse,16,,,161310000D0083,,,,,,,,,,,,,0,,,,,BR,futaies résineuses,,,2545,0.729387,46.027729
2019-202988,2019-05-15,000001,Vente,29120,,,LANDE DU TAIS,B093,16500,16131,Esse,16,,,161310000D0232,,,,,,,,,,,,,0,,,,,VI,vignes,,,2000,0.731045,46.022932
2019-202988,2019-05-15,000001,Vente,29120,,,LANDE DU TAIS,B093,16500,16131,Esse,16,,,161310000D0232,,,,,,,,,,,,,0,,,,,T,terres,,,3070,0.731045,46.022932
2019-202988,2019-05-15,000001,Vente,29120,,,LANDE DU TAIS,B093,16500,16131,Esse,16,,,161310000D0233,,,,,,,,,,,,,0,,,,,BT,taillis simples,,,950,0.731295,46.023372
2019-202988,2019-05-15,000001,Vente,29120,,,LANDE DU TAIS,B093,16500,16131,Esse,16,,,161310000D0234,,,,,,,,,,,,,0,,,,,BT,taillis simples,,,1580,0.73135,46.023522
2019-202988,2019-05-15,000001,Vente,29120,,,LANDE DU TAIS,B093,16500,16131,Esse,16,,,161310000D0235,,,,,,,,,,,,,0,,,,,BT,taillis simples,,,920,0.731607,46.023659
2019-202988,2019-05-15,000001,Vente,29120,,,LE MAROUIN,B104,16500,16131,Esse,16,,,161310000D1484,,,,,,,,,,,,,0,,,,,S,sols,,,103,,
2019-202988,2019-05-15,000001,Vente,29120,,,LE MAROUIN,B104,16500,16131,Esse,16,,,161310000D1510,,,,,,,,,,,,,0,,,,,BT,taillis simples,,,961,0.729978,46.028134
2019-202988,2019-05-15,000001,Vente,29120,,,LE MAROUIN,B104,16500,16131,Esse,16,,,161310000D1510,,,,,,,,,,,,,0,,,,,E,eaux,MARE,Mare,300,0.729978,46.028134
2019-203022,2019-06-13,000002,Vente,,,,LE GRAND NEUVILLE,B070,16500,16131,Esse,16,,,161310000E1767,,,,,,,,,,,,,0,,,,,S,sols,,,18,,
2019-203022,2019-06-13,000002,Vente,,,,LE GRAND NEUVILLE,B070,16500,16131,Esse,16,,,161310000E1754,,,,,,,,,,,,,0,,,,,S,sols,,,2,0.702938,46.025562
2019-203022,2019-06-13,000002,Vente,,,,LE GRAND NEUVILLE,B070,16500,16131,Esse,16,,,161310000E1757,,,,,,,,,,,,,0,,,,,S,sols,,,143,,
2019-203022,2019-06-13,000002,Vente,,,,LE GRAND NEUVILLE,B070,16500,16131,Esse,16,,,161310000E1761,,,,,,,,,,,,,0,,,,,S,sols,,,1,,
2019-203022,2019-06-13,000002,Vente,,,,L ETANG,B050,16500,16131,Esse,16,,,161310000E1765,,,,,,,,,,,,,0,,,,,L,landes,,,32,,
2019-203201,2019-06-29,000002,Vente,,,,LE GRAND NEUVILLE,B070,16500,16131,Esse,16,,,161310000E1759,,,,,,,,,,,,,0,,,,,S,sols,,,147,,
2019-203313,2019-07-09,000001,Vente,100,,,LE GRAND NEUVILLE,B070,16500,16131,Esse,16,,,161310000E1756,,,,,,,,,,,,,0,,,,,S,sols,,,17,0.70262,46.025176
2019-203411,2019-06-27,000001,Vente,70000,1,,RTE DE CONFOLENS,0018,16500,16131,Esse,16,,,161310000D1489,,,,,,,,,,,,,0,1,Maison,81,5,S,sols,,,1273,0.72429,46.030522
2019-204232,2019-10-17,000002,Vente,50,,,LA CHAISE,B025,16500,16131,Esse,16,,,161310000D2080,,,,,,,,,,,,,0,,,,,S,sols,,,40,0.72608,46.004562
2019-204233,2019-10-17,000001,Vente,1300,,,PRE DE LA GRANGE,B139,16500,16131,Esse,16,,,161310000D1917,,,,,,,,,,,,,0,,,,,BR,futaies résineuses,,,5200,0.727912,46.004492
2019-204248,2019-10-21,000001,Vente,10000,,,LA CHAISE,B025,16500,16131,Esse,16,,,161310000D1015,,,,,,,,,,,,,0,,,,,S,sols,,,85,0.726137,46.004419
2019-204248,2019-10-21,000001,Vente,10000,5304,,LA CHAISE,B025,16500,16131,Esse,16,,,161310000D1016,,,,,,,,,,,,,0,1,Maison,72,2,S,sols,,,65,0.726197,46.004438
2019-204248,2019-10-21,000001,Vente,10000,,,LA CHAISE,B025,16500,16131,Esse,16,,,161310000D2081,,,,,,,,,,,,,0,,,,,S,sols,,,70,0.726082,46.004511
2019-204297,2019-10-25,000001,Vente,76000,9,,IMP DU PETIT RUISSEAU,0058,16500,16131,Esse,16,,,161310000E1199,,,,,,,,,,,,,0,1,Maison,95,4,S,sols,,,1019,0.717489,46.030025
2019-204315,2019-10-28,000001,Vente,12379.5,,,AUX CLAPIERS,B044,16500,16131,Esse,16,,,161310000E1724,,,,,,,,,,,,,0,,,,,AB,terrains a bâtir,,,917,0.716089,46.030133
2019-204666,2019-11-23,000001,Vente,167000,5,,RTE DE LESTERPS,0050,16500,16131,Esse,16,,,161310000D0320,,,,,,,,,,,,,0,1,Maison,95,5,S,sols,,,372,0.736102,46.029901
2019-204666,2019-11-23,000001,Vente,167000,,,LA COUR,B045,16500,16131,Esse,16,,,161310000D0321,,,,,,,,,,,,,0,,,,,J,jardins,,,310,0.736344,46.030126
2019-204666,2019-11-23,000001,Vente,167000,,,LA COUR,B045,16500,16131,Esse,16,,,161310000D0322,,,,,,,,,,,,,0,,,,,P,prés,,,2125,0.736833,46.030115
2019-204666,2019-11-23,000001,Vente,167000,5094,,LA COUR,B045,16500,16131,Esse,16,,,161310000D1182,,,,,,,,,,,,,0,1,Maison,45,1,S,sols,,,331,0.736326,46.029876
2019-204666,2019-11-23,000001,Vente,167000,,,LA COUR,B045,16500,16131,Esse,16,,,161310000D1183,,,,,,,,,,,,,0,,,,,J,jardins,,,248,0.736382,46.030039
2019-204666,2019-11-23,000001,Vente,167000,,,LA COUR,B045,16500,16131,Esse,16,,,161310000D1184,,,,,,,,,,,,,0,,,,,S,sols,,,248,0.736079,46.030026
2019-204666,2019-11-23,000001,Vente,167000,,,LA COUR,B045,16500,16131,Esse,16,,,161310000D1185,,,,,,,,,,,,,0,,,,,S,sols,,,256,0.736065,46.030117
2019-204715,2019-12-09,000001,Vente,13000.5,,,AUX CLAPIERS,B044,16500,16131,Esse,16,,,161310000E1725,,,,,,,,,,,,,0,,,,,AB,terrains a bâtir,,,963,0.716153,46.02991
