id_mutation,date_mutation,numero_disposition,nature_mutation,valeur_fonciere,adresse_numero,adresse_suffixe,adresse_nom_voie,adresse_code_voie,code_postal,code_commune,nom_commune,code_departement,ancien_code_commune,ancien_nom_commune,id_parcelle,ancien_id_parcelle,numero_volume,lot1_numero,lot1_surface_carrez,lot2_numero,lot2_surface_carrez,lot3_numero,lot3_surface_carrez,lot4_numero,lot4_surface_carrez,lot5_numero,lot5_surface_carrez,nombre_lots,code_type_local,type_local,surface_reelle_bati,nombre_pieces_principales,code_nature_culture,nature_culture,code_nature_culture_speciale,nature_culture_speciale,surface_terrain,longitude,latitude
2019-205061,2019-01-07,000001,Vente,170000,30,,RUE PIERRE VIALA,0080,16130,16366,Segonzac,16,,,16366000AC0313,,,,,,,,,,,,,0,1,Maison,112,4,S,sols,,,550,-0.223247,45.616671
2019-205061,2019-01-07,000001,Vente,170000,,,LES GRANDES VERSENNES,B128,16130,16366,Segonzac,16,,,16366000AC0426,,,,,,,,,,,,,0,,,,,T,terres,,,1558,-0.223427,45.616578
2019-205085,2019-01-18,000002,Echange,4000,,,LES SABLES,B210,16130,16366,Segonzac,16,,,163660000H0252,,,,,,,,,,,,,0,,,,,T,terres,,,2530,-0.184191,45.60468
2019-205085,2019-01-18,000002,Echange,4000,,,LES SABLES,B210,16130,16366,Segonzac,16,,,163660000H0252,,,,,,,,,,,,,0,,,,,VI,vignes,,,6500,-0.184191,45.60468
2019-205096,2019-01-03,000001,Vente,85000,4,,RUE DE LA TOUR,0089,16130,16366,Segonzac,16,,,16366000AD0137,,,,,,,,,,,,,0,1,Maison,68,3,S,sols,,,615,-0.215819,45.61478
2019-205096,2019-01-03,000001,Vente,85000,,,CHADEVILLE,B043,16130,16366,Segonzac,16,,,16366000AD0138,,,,,,,,,,,,,0,,,,,J,jardins,,,600,-0.215736,45.614902
2019-205096,2019-01-03,000001,Vente,85000,,,CHADEVILLE,B043,16130,16366,Segonzac,16,,,16366000AD0138,,,,,,,,,,,,,0,,,,,S,sols,,,55,-0.215736,45.614902
2019-205096,2019-01-03,000001,Vente,85000,,,CHADEVILLE,B043,16130,16366,Segonzac,16,,,16366000AD0304,,,,,,,,,,,,,0,,,,,P,prés,,,400,-0.215485,45.614755
2019-205096,2019-01-03,000001,Vente,85000,,,CHADEVILLE,B043,16130,16366,Segonzac,16,,,16366000AD0304,,,,,,,,,,,,,0,,,,,S,sols,,,20,-0.215485,45.614755
2019-205096,2019-01-03,000001,Vente,85000,,,CHADEVILLE,B043,16130,16366,Segonzac,16,,,16366000AD0311,,,,,,,,,,,,,0,,,,,T,terres,,,228,-0.215686,45.614623
2019-205099,2019-01-29,000001,Vente,3000,,,LES GRANDES VERSENNES,B128,16130,16366,Segonzac,16,,,16366000AM0097,,,,,,,,,,,,,0,,,,,T,terres,,,402,-0.218676,45.622728
2019-205210,2019-02-15,000001,Vente,350000,5535,,CHEZ RICHON,B070,16130,16366,Segonzac,16,,,163660000E0236,,,,,,,,,,,,,0,1,Maison,250,8,S,sols,,,2513,-0.178052,45.626407
2019-205210,2019-02-15,000001,Vente,350000,,,CHEZ RICHON,B070,16130,16366,Segonzac,16,,,163660000E0237,,,,,,,,,,,,,0,,,,,P,prés,,,5763,-0.176949,45.626388
2019-205302,2019-02-22,000001,Vente,19273,,,LES TERRIERS,B227,16130,16366,Segonzac,16,,,163660000A0148,,,,,,,,,,,,,0,,,,,T,terres,,,2024,-0.22834,45.643944
2019-205302,2019-02-22,000001,Vente,19273,,,LES TERRIERS,B227,16130,16366,Segonzac,16,,,163660000A0149,,,,,,,,,,,,,0,,,,,T,terres,,,3612,-0.228291,45.643779
2019-205302,2019-02-22,000001,Vente,19273,,,LES TERRIERS,B227,16130,16366,Segonzac,16,,,163660000A0150,,,,,,,,,,,,,0,,,,,T,terres,,,3410,-0.228476,45.643598
2019-205302,2019-02-22,000001,Vente,19273,,,LES TERRIERS,B227,16130,16366,Segonzac,16,,,163660000A0168,,,,,,,,,,,,,0,,,,,T,terres,,,900,-0.231378,45.643874
2019-205302,2019-02-22,000001,Vente,19273,,,CHENE BARRAUD,B055,16130,16366,Segonzac,16,,,163660000A0196,,,,,,,,,,,,,0,,,,,T,terres,,,21460,,
2019-205302,2019-02-22,000001,Vente,19273,,,LES TERRES BLANCHES,B216,16130,16366,Segonzac,16,,,163660000A0237,,,,,,,,,,,,,0,,,,,T,terres,,,4338,,
2019-205302,2019-02-22,000001,Vente,19273,,,LE PONTREAU,B196,16130,16366,Segonzac,16,,,163660000A0605,,,,,,,,,,,,,0,,,,,T,terres,,,1654,,
2019-205302,2019-02-22,000001,Vente,19273,,,LE PONTREAU,B196,16130,16366,Segonzac,16,,,163660000A0638,,,,,,,,,,,,,0,,,,,T,terres,,,4384,,
2019-205304,2019-02-22,000001,Vente,74000,18,,RUE RAVAZ,0085,16130,16366,Segonzac,16,,,16366000AB0157,,,,,,,,,,,,,0,1,Maison,115,4,S,sols,,,134,-0.22048,45.618706
2019-205367,2019-03-14,000001,Vente,5000,,,DEUVILLE,B099,16130,16366,Segonzac,16,,,163660000M1340,,,,,,,,,,,,,0,,,,,S,sols,,,2071,-0.249621,45.619831
2019-205373,2019-03-15,000001,Vente,92000,32,,RUE DU HUIT MAI 1945,0063,16130,16366,Segonzac,16,,,16366000AI0064,,,,,,,,,,,,,0,1,Maison,92,4,S,sols,,,798,-0.226004,45.619505
2019-205401,2019-03-28,000002,Echange,35000,,,PAIN PERDU,B174,16130,16366,Segonzac,16,,,163660000C1006,,,,,,,,,,,,,0,,,,,VI,vignes,,,7594,-0.196966,45.638404
2019-205404,2019-03-21,000001,Vente,60000,,,LE PEUX,B181,16130,16366,Segonzac,16,,,16366000AD0037,,,,,,,,,,,,,0,,,,,T,terres,,,1131,-0.223105,45.61327
2019-205404,2019-03-21,000001,Vente,60000,,,LE PEUX,B181,16130,16366,Segonzac,16,,,16366000AD0276,,,,,,,,,,,,,0,,,,,J,jardins,,,218,-0.221752,45.613935
2019-205404,2019-03-21,000001,Vente,60000,16,,RUE DU PEU,0077,16130,16366,Segonzac,16,,,16366000AD0435,,,,,,,,,,,,,0,1,Maison,65,2,S,sols,,,757,-0.221905,45.613946
2019-205404,2019-03-21,000001,Vente,60000,,,LE PEUX,B181,16130,16366,Segonzac,16,,,16366000AD0436,,,,,,,,,,,,,0,,,,,T,terres,,,1122,,
2019-205442,2019-03-29,000001,Vente,4200000,,,CHEZ MATTE,B068,16130,16366,Segonzac,16,,,163660000E0204,,,,,,,,,,,,,0,,,,,T,terres,,,1830,-0.178116,45.629311
2019-205442,2019-03-29,000001,Vente,4200000,1,,RTE DE BOUTEVILLE,0325,16130,16366,Segonzac,16,,,163660000E0205,,,,,,,,,,,,,0,,,,,T,terres,,,11075,-0.178842,45.628748
2019-205442,2019-03-29,000001,Vente,4200000,,,CHEZ MATTE,B068,16130,16366,Segonzac,16,,,163660000E0206,,,,,,,,,,,,,0,,,,,P,prés,,,710,-0.178065,45.628333
2019-205442,2019-03-29,000001,Vente,4200000,,,CHEZ MATTE,B068,16130,16366,Segonzac,16,,,163660000E0207,,,,,,,,,,,,,0,,,,,S,sols,,,2721,-0.177641,45.628663
2019-205442,2019-03-29,000001,Vente,4200000,3,,RTE DE BOUTEVILLE,0325,16130,16366,Segonzac,16,,,163660000E0208,,,,,,,,,,,,,0,4,Local industriel. commercial ou assimilé,3651,0,S,sols,,,2690,-0.177506,45.628384
2019-205442,2019-03-29,000001,Vente,4200000,1,,CHE JEAN BRARD,0330,16130,16366,Segonzac,16,,,163660000E0209,,,,,,,,,,,,,0,,,,,J,jardins,,,2450,-0.177316,45.628249
2019-205442,2019-03-29,000001,Vente,4200000,1,,CHE JEAN BRARD,0330,16130,16366,Segonzac,16,,,163660000E0209,,,,,,,,,,,,,0,,,,,S,sols,,,1500,-0.177316,45.628249
2019-205442,2019-03-29,000001,Vente,4200000,,,CHEZ MATTE,B068,16130,16366,Segonzac,16,,,163660000E0210,,,,,,,,,,,,,0,,,,,S,sols,,,3500,-0.177474,45.629617
2019-205442,2019-03-29,000001,Vente,4200000,,,CHEZ MATTE,B068,16130,16366,Segonzac,16,,,163660000E0210,,,,,,,,,,,,,0,,,,,T,terres,,,11070,-0.177474,45.629617
2019-205442,2019-03-29,000001,Vente,4200000,,,CHEZ MATTE,B068,16130,16366,Segonzac,16,,,163660000E0211,,,,,,,,,,,,,0,,,,,T,terres,,,10884,-0.176414,45.629692
2019-205455,2019-04-05,000001,Vente,90000,10,,RUE HENRY GOURRY LAURAND,0061,16130,16366,Segonzac,16,,,16366000AD0088,,,,,,,,,,,,,0,1,Maison,90,3,S,sols,,,151,-0.219798,45.61494
2019-205482,2019-04-12,000001,Vente,60000,1,,CHEM DE JOVILLE,0067,16130,16366,Segonzac,16,,,16366000AD0208,,,,,,,,,,,,,0,1,Maison,43,3,S,sols,,,480,-0.215273,45.612929
2019-205515,2019-04-25,000001,Vente,155000,5000,,RUE HENRY GOURRY LAURAND,0061,16130,16366,Segonzac,16,,,16366000AC0121,,,,,,,,,,,,,0,2,Appartement,25,1,S,sols,,,366,-0.218632,45.615403
2019-205515,2019-04-25,000001,Vente,155000,5000,,RUE HENRY GOURRY LAURAND,0061,16130,16366,Segonzac,16,,,16366000AC0121,,,,,,,,,,,,,0,1,Maison,74,3,S,sols,,,366,-0.218632,45.615403
2019-205515,2019-04-25,000001,Vente,155000,5000,,RUE HENRY GOURRY LAURAND,0061,16130,16366,Segonzac,16,,,16366000AC0121,,,,,,,,,,,,,0,1,Maison,166,5,S,sols,,,366,-0.218632,45.615403
2019-205515,2019-04-25,000001,Vente,155000,,,LE BOURG,B035,16130,16366,Segonzac,16,,,16366000AC0125,,,,,,,,,,,,,0,,,,,S,sols,,,158,-0.218799,45.615178
2019-205515,2019-04-25,000001,Vente,155000,,,LE BOURG,B035,16130,16366,Segonzac,16,,,16366000AC0438,,,,,,,,,,,,,0,,,,,S,sols,,,194,-0.218756,45.61534
2019-205540,2019-04-25,000001,Vente,120700,5422,,LE BOC,B008,16130,16366,Segonzac,16,,,163660000C0316,,,,,,,,,,,,,0,1,Maison,165,7,S,sols,,,1404,-0.217099,45.635087
2019-205540,2019-04-25,000001,Vente,120700,,,LE BOC,B008,16130,16366,Segonzac,16,,,163660000C0317,,,,,,,,,,,,,0,,,,,T,terres,,,558,-0.217394,45.635715
2019-205540,2019-04-25,000001,Vente,120700,,,LE BOC,B008,16130,16366,Segonzac,16,,,163660000C0855,,,,,,,,,,,,,0,,,,,J,jardins,,,129,-0.216932,45.635023
2019-205540,2019-04-25,000001,Vente,120700,,,LE BOC,B008,16130,16366,Segonzac,16,,,163660000C0857,,,,,,,,,,,,,0,,,,,S,sols,,,36,-0.216963,45.634945
2019-205552,2019-05-14,000001,Vente,277318,2,,RUE DE LA TOUR,0089,16130,16366,Segonzac,16,,,16366000AD0135,,,,,,,,,,,,,0,1,Maison,140,5,S,sols,,,375,-0.216333,45.614601
2019-205552,2019-05-14,000001,Vente,277318,,,CHADEVILLE,B043,16130,16366,Segonzac,16,,,16366000AD0136,,,,,,,,,,,,,0,,,,,S,sols,,,370,-0.216151,45.614737
2019-205552,2019-05-14,000001,Vente,277318,,,CHADEVILLE,B043,16130,16366,Segonzac,16,,,16366000AD0212,,,,,,,,,,,,,0,,,,,S,sols,,,193,-0.216059,45.614646
2019-205552,2019-05-14,000001,Vente,277318,,,CHADEVILLE,B043,16130,16366,Segonzac,16,,,16366000AD0214,,,,,,,,,,,,,0,,,,,S,sols,,,174,-0.216316,45.614503
2019-205678,2019-05-27,000001,Vente,218780,,,SOUS LES BRANDES,B214,16130,16366,Segonzac,16,,,163660000H0065,,,,,,,,,,,,,0,,,,,VI,vignes,,,7442,-0.203425,45.60888
2019-205678,2019-05-27,000001,Vente,218780,,,SOUS LES BRANDES,B214,16130,16366,Segonzac,16,,,163660000H0066,,,,,,,,,,,,,0,,,,,VI,vignes,,,13610,-0.203895,45.609079
2019-205678,2019-05-27,000001,Vente,218780,,,SOUS LES BRANDES,B214,16130,16366,Segonzac,16,,,163660000H0699,,,,,,,,,,,,,0,,,,,VI,vignes,,,7178,-0.203116,45.608689
2019-205678,2019-05-27,000001,Vente,218780,,,PLANTE DE JOVILLE,B186,16130,16366,Segonzac,16,,,163660000H0819,,,,,,,,,,,,,0,,,,,VI,vignes,,,2335,-0.206823,45.60703
2019-205678,2019-05-27,000001,Vente,218780,,,PLANTE DE JOVILLE,B186,16130,16366,Segonzac,16,,,163660000H0820,,,,,,,,,,,,,0,,,,,VI,vignes,,,2333,-0.206612,45.606969
2019-205678,2019-05-27,000001,Vente,218780,,,PLANTE DE JOVILLE,B186,16130,16366,Segonzac,16,,,163660000H0821,,,,,,,,,,,,,0,,,,,VI,vignes,,,1219,-0.20645,45.607843
2019-205678,2019-05-27,000001,Vente,218780,,,PLANTE DE JOVILLE,B186,16130,16366,Segonzac,16,,,163660000H0822,,,,,,,,,,,,,0,,,,,VI,vignes,,,13387,-0.206203,45.606975
2019-205678,2019-05-27,000001,Vente,218780,,,PLANTE DE JOVILLE,B186,16130,16366,Segonzac,16,,,163660000H0823,,,,,,,,,,,,,0,,,,,VI,vignes,,,1114,-0.207156,45.606253
2019-205681,2019-05-21,000001,Vente,81000,46,,RUE DU HUIT MAI 1945,0063,16130,16366,Segonzac,16,,,16366000AI0040,,,,,,,,,,,,,0,1,Maison,99,5,S,sols,,,316,-0.224368,45.618839
2019-205804,2019-06-18,000001,Vente,180000,11,,RUE DU HUIT MAI 1945,0063,16130,16366,Segonzac,16,,,16366000AI0078,,,,,,,,,,,,,0,1,Maison,166,5,S,sols,,,889,-0.225089,45.619855
2019-205811,2019-06-19,000001,Vente,150000,6,,CHE JEAN BRARD,0330,16130,16366,Segonzac,16,,,163660000E0420,,,,,,,,,,,,,0,1,Maison,83,4,S,sols,,,1697,-0.170593,45.633112
2019-205811,2019-06-19,000001,Vente,150000,6,,CHE JEAN BRARD,0330,16130,16366,Segonzac,16,,,163660000E0420,,,,,,,,,,,,,0,1,Maison,83,4,T,terres,,,3303,-0.170593,45.633112
2019-205890,2019-07-05,000001,Vente,3860,,,LES GRANDES VERSENNES,B128,16130,16366,Segonzac,16,,,16366000AM0091,,,,,,,,,,,,,0,,,,,T,terres,,,386,-0.218718,45.625057
2019-205952,2019-07-18,000001,Vente,69500,10,,RUE DU MAINE FRAPPIN,0070,16130,16366,Segonzac,16,,,16366000AD0084,,,,,,,,,,,,,0,1,Maison,64,2,S,sols,,,33,-0.219792,45.615201
2019-205955,2019-07-19,000001,Vente,238000,7,,RUE DU LOTISSEMENT DE LA TOUR,0069,16130,16366,Segonzac,16,,,16366000AO0024,,,,,,,,,,,,,0,1,Maison,136,6,AG,terrains d'agrément,,,486,-0.213375,45.618753
2019-205955,2019-07-19,000001,Vente,238000,7,,RUE DU LOTISSEMENT DE LA TOUR,0069,16130,16366,Segonzac,16,,,16366000AO0024,,,,,,,,,,,,,0,1,Maison,136,6,S,sols,,,500,-0.213375,45.618753
2019-205956,2019-07-26,000001,Vente,99900,14,,RUE GASTON BRIAND,0055,16130,16366,Segonzac,16,,,16366000AC0166,,,,,,,,,,,,,0,1,Maison,75,3,S,sols,,,285,-0.219056,45.616407
2019-205961,2019-07-24,000001,Vente,1,5538,,LE VIGNAUD,B236,16130,16366,Segonzac,16,,,163660000E0854,,,,,,,,,,,,,0,1,Maison,58,1,S,sols,,,895,-0.187261,45.628001
2019-206085,2019-08-30,000001,Vente,160000,3,,RTE DE ST MEME LES CARRIERES,0332,16130,16366,Segonzac,16,,,163660000D0573,,,,,,,,,,,,,0,1,Maison,84,3,S,sols,,,1000,-0.176519,45.63427
2019-206085,2019-08-30,000001,Vente,160000,3,,RTE DE ST MEME LES CARRIERES,0332,16130,16366,Segonzac,16,,,163660000D0573,,,,,,,,,,,,,0,1,Maison,84,3,T,terres,,,7151,-0.176519,45.63427
2019-206109,2019-07-26,000001,Vente,108000,,,GUETTE A BOIRE,B135,16130,16366,Segonzac,16,,,163660000A0046,,,,,,,,,,,,,0,,,,,T,terres,,,966,-0.244658,45.642465
2019-206109,2019-07-26,000001,Vente,108000,,,GUETTE A BOIRE,B135,16130,16366,Segonzac,16,,,163660000A0047,,,,,,,,,,,,,0,,,,,T,terres,,,3050,-0.244888,45.642636
2019-206109,2019-07-26,000001,Vente,108000,,,GUETTE A BOIRE,B135,16130,16366,Segonzac,16,,,163660000A0048,,,,,,,,,,,,,0,,,,,T,terres,,,500,-0.24528,45.642745
2019-206109,2019-07-26,000001,Vente,108000,,,GUETTE A BOIRE,B135,16130,16366,Segonzac,16,,,163660000A0049,,,,,,,,,,,,,0,,,,,T,terres,,,424,-0.245417,45.642796
2019-206109,2019-07-26,000001,Vente,108000,,,GUETTE A BOIRE,B135,16130,16366,Segonzac,16,,,163660000A0826,,,,,,,,,,,,,0,,,,,T,terres,,,2750,-0.244723,45.643206
2019-206109,2019-07-26,000001,Vente,108000,,,GUETTE A BOIRE,B135,16130,16366,Segonzac,16,,,163660000A0832,,,,,,,,,,,,,0,,,,,T,terres,,,1090,-0.244536,45.642417
2019-206119,2019-08-27,000001,Vente,70400,14,,RUE DE LA COUTURE,0051,16130,16366,Segonzac,16,,,16366000AN0039,,,,,,,,,,,,,0,1,Maison,102,5,AG,terrains d'agrément,,,781,-0.217262,45.6227
2019-206119,2019-08-27,000001,Vente,70400,14,,RUE DE LA COUTURE,0051,16130,16366,Segonzac,16,,,16366000AN0039,,,,,,,,,,,,,0,1,Maison,102,5,S,sols,,,500,-0.217262,45.6227
2019-206149,2019-08-23,000001,Vente,200000,1,,RUE SAUTE OIGNON,0086,16130,16366,Segonzac,16,,,16366000AM0078,,,,,,,,,,,,,0,1,Maison,113,5,S,sols,,,500,-0.223958,45.622331
2019-206149,2019-08-23,000001,Vente,200000,1,,RUE SAUTE OIGNON,0086,16130,16366,Segonzac,16,,,16366000AM0078,,,,,,,,,,,,,0,1,Maison,113,5,AG,terrains d'agrément,,,659,-0.223958,45.622331
2019-206205,2019-09-12,000002,Vente,130000,,,LES FOSSES,B114,16130,16366,Segonzac,16,,,16366000AB0187,,,,,,,,,,,,,0,,,,,P,prés,,,820,-0.221007,45.619774
2019-206205,2019-09-12,000002,Vente,130000,,,LES FOSSES,B114,16130,16366,Segonzac,16,,,16366000AB0257,,,,,,,,,,,,,0,,,,,J,jardins,,,573,-0.220745,45.619056
2019-206205,2019-09-12,000002,Vente,130000,,,LES FOSSES,B114,16130,16366,Segonzac,16,,,16366000AB0259,,,,,,,,,,,,,0,,,,,P,prés,,,1146,-0.220478,45.619264
2019-206205,2019-09-12,000002,Vente,130000,22,,RUE RAVAZ,0085,16130,16366,Segonzac,16,,,16366000AB0326,,,,,,,,,,,,,0,4,Local industriel. commercial ou assimilé,40,0,S,sols,,,77,-0.220755,45.618942
2019-206205,2019-09-12,000002,Vente,130000,22,,RUE RAVAZ,0085,16130,16366,Segonzac,16,,,16366000AB0326,,,,,,,,,,,,,0,1,Maison,120,5,S,sols,,,77,-0.220755,45.618942
2019-206205,2019-09-12,000002,Vente,130000,22,,RUE RAVAZ,0085,16130,16366,Segonzac,16,,,16366000AB0327,,,,,,,,,,,,,0,,,,,S,sols,,,182,-0.220735,45.618886
2019-206205,2019-09-12,000002,Vente,130000,22,,RUE RAVAZ,0085,16130,16366,Segonzac,16,,,16366000AB0328,,,,,,,,,,,,,0,,,,,S,sols,,,438,-0.220906,45.618909
2019-206208,2019-09-25,000001,Vente,210000,5412,,CHEZ BARRAUD,B057,16130,16366,Segonzac,16,,,163660000A0546,,,,,,,,,,,,,0,1,Maison,59,2,S,sols,,,652,-0.227129,45.636378
2019-206208,2019-09-25,000001,Vente,210000,5412,,CHEZ BARRAUD,B057,16130,16366,Segonzac,16,,,163660000A0546,,,,,,,,,,,,,0,1,Maison,132,5,S,sols,,,652,-0.227129,45.636378
2019-206208,2019-09-25,000001,Vente,210000,,,CHEZ BARRAUD,B057,16130,16366,Segonzac,16,,,163660000A0547,,,,,,,,,,,,,0,,,,,J,jardins,,,330,-0.227376,45.636358
2019-206218,2019-09-17,000002,Vente,25000,,,LE MAINE MOREAU,B152,16130,16366,Segonzac,16,,,16366000AN0116,,,,,,,,,,,,,0,,,,,T,terres,,,157,,
2019-206218,2019-09-17,000002,Vente,25000,,,LE MAINE MOREAU,B152,16130,16366,Segonzac,16,,,16366000AN0117,,,,,,,,,,,,,0,,,,,T,terres,,,771,,
2019-206239,2019-02-25,000001,Vente,41000,26,,RUE MILLARDET,0072,16130,16366,Segonzac,16,,,16366000AB0311,,,,,,,,,,,,,0,4,Local industriel. commercial ou assimilé,59,0,S,sols,,,410,-0.215893,45.619987
2019-206239,2019-02-25,000001,Vente,41000,24,,RUE MILLARDET,0072,16130,16366,Segonzac,16,,,16366000AB0314,,,,,,,,,,,,,0,1,Maison,54,2,S,sols,,,100,-0.216056,45.619878
2019-206292,2019-09-27,000001,Vente,51851.05,,,AU MALESTIER,B154,16130,16366,Segonzac,16,,,16366000AE0007,,,,,,,,,,,,,0,,,,,AB,terrains a bâtir,,,3202,-0.230753,45.616392
2019-206364,2019-10-10,000001,Vente,104973,,,L HAUSSUPE,B137,16130,16366,Segonzac,16,,,163660000C0467,,,,,,,,,,,,,0,,,,,VI,vignes,,,8190,-0.214842,45.629902
2019-206364,2019-10-10,000001,Vente,104973,,,LES MATS,B161,16130,16366,Segonzac,16,,,163660000G0024,,,,,,,,,,,,,0,,,,,VI,vignes,,,2550,-0.22134,45.628636
2019-206364,2019-10-10,000001,Vente,104973,,,LES MATS,B161,16130,16366,Segonzac,16,,,163660000G0344,,,,,,,,,,,,,0,,,,,VI,vignes,,,802,-0.221305,45.628492
2019-206364,2019-10-10,000001,Vente,104973,,,LES MATS,B161,16130,16366,Segonzac,16,,,163660000G0349,,,,,,,,,,,,,0,,,,,VI,vignes,,,302,-0.221149,45.628947
2019-206364,2019-10-10,000001,Vente,104973,,,LES MATS,B161,16130,16366,Segonzac,16,,,163660000G0351,,,,,,,,,,,,,0,,,,,T,terres,,,7242,-0.219834,45.629711
2019-206365,2019-10-15,000001,Vente,130000,6,,RUE DES MALASTIERS,0071,16130,16366,Segonzac,16,,,16366000AI0056,,,,,,,,,,,,,0,1,Maison,83,4,S,sols,,,894,-0.2253,45.617608
2019-206372,2019-10-07,000001,Vente,17190,,,PLANTIER DE CHADEVILLE,B191,16130,16366,Segonzac,16,,,163660000I0062,,,,,,,,,,,,,0,,,,,T,terres,,,1890,-0.214572,45.601297
2019-206372,2019-10-07,000001,Vente,17190,,,TERRES DE LA TOUCHE,B219,16130,16366,Segonzac,16,,,163660000I0680,,,,,,,,,,,,,0,,,,,T,terres,,,9310,-0.224099,45.604814
2019-206372,2019-10-07,000001,Vente,17190,,,LES JUSTICES,B139,16130,16366,Segonzac,16,,,163660000K0363,,,,,,,,,,,,,0,,,,,T,terres,,,2552,-0.226527,45.587614
2019-206415,2019-10-22,000001,Vente,53000,3,,RUE PIERRE VIALA,0080,16130,16366,Segonzac,16,,,16366000AC0179,,,,,,,,,,,,,0,1,Maison,50,2,S,sols,,,28,-0.219212,45.617085
2019-206415,2019-10-22,000001,Vente,53000,3,,RUE PIERRE VIALA,0080,16130,16366,Segonzac,16,,,16366000AC0179,,,,,,,,,,,,,0,4,Local industriel. commercial ou assimilé,18,0,S,sols,,,28,-0.219212,45.617085
2019-206437,2019-10-30,000001,Vente,250,,,LE BOUILLON,B033,16130,16366,Segonzac,16,,,163660000A0189,,,,,,,,,,,,,0,,,,,T,terres,,,250,-0.236077,45.641121
2019-206438,2019-10-30,000002,Vente,45000,,,CHEZ BERTAUDAUD,B058,16130,16366,Segonzac,16,,,163660000B0775,,,,,,,,,,,,,0,,,,,J,jardins,,,411,-0.231418,45.634257
2019-206438,2019-10-30,000002,Vente,45000,,,CHEZ BERTAUDAUD,B058,16130,16366,Segonzac,16,,,163660000B0778,,,,,,,,,,,,,0,,,,,S,sols,,,491,-0.231453,45.633963
2019-206455,2019-11-18,000001,Vente,333625.3,,,LES GRANDES VERSENNES,B128,16130,16366,Segonzac,16,,,16366000AM0003,,,,,,,,,,,,,0,,,,,VI,vignes,,,6286,-0.220631,45.623015
2019-206455,2019-11-18,000001,Vente,333625.3,,,LES GRANDES VERSENNES,B128,16130,16366,Segonzac,16,,,16366000AM0004,,,,,,,,,,,,,0,,,,,T,terres,,,5529,,
2019-206455,2019-11-18,000001,Vente,333625.3,,,LES GRANDES VERSENNES,B128,16130,16366,Segonzac,16,,,16366000AM0005,,,,,,,,,,,,,0,,,,,VI,vignes,,,6393,-0.220301,45.623469
2019-206455,2019-11-18,000001,Vente,333625.3,,,LES GRANDES VERSENNES,B128,16130,16366,Segonzac,16,,,16366000AM0006,,,,,,,,,,,,,0,,,,,VI,vignes,,,3781,-0.22056,45.623905
2019-206455,2019-11-18,000001,Vente,333625.3,,,LES GRANDES VERSENNES,B128,16130,16366,Segonzac,16,,,16366000AM0008,,,,,,,,,,,,,0,,,,,T,terres,,,4829,,
2019-206455,2019-11-18,000001,Vente,333625.3,,,LES GRANDES VERSENNES,B128,16130,16366,Segonzac,16,,,16366000AM0009,,,,,,,,,,,,,0,,,,,T,terres,,,4988,,
2019-206455,2019-11-18,000001,Vente,333625.3,,,LES GRANDES VERSENNES,B128,16130,16366,Segonzac,16,,,16366000AM0010,,,,,,,,,,,,,0,,,,,T,terres,,,9145,,
2019-206455,2019-11-18,000001,Vente,333625.3,,,LES GRANDES VERSENNES,B128,16130,16366,Segonzac,16,,,16366000AM0011,,,,,,,,,,,,,0,,,,,T,terres,,,12642,,
2019-206455,2019-11-18,000001,Vente,333625.3,,,LES GRANDES VERSENNES,B128,16130,16366,Segonzac,16,,,16366000AM0017,,,,,,,,,,,,,0,,,,,T,terres,,,386,-0.218086,45.624069
2019-206455,2019-11-18,000001,Vente,333625.3,,,LES GRANDES VERSENNES,B128,16130,16366,Segonzac,16,,,16366000AM0018,,,,,,,,,,,,,0,,,,,T,terres,,,150,-0.21861,45.623697
2019-206455,2019-11-18,000001,Vente,333625.3,,,LES GRANDES VERSENNES,B128,16130,16366,Segonzac,16,,,16366000AM0019,,,,,,,,,,,,,0,,,,,T,terres,,,1572,-0.218117,45.623889
2019-206455,2019-11-18,000001,Vente,333625.3,,,LES GRANDES VERSENNES,B128,16130,16366,Segonzac,16,,,16366000AM0036,,,,,,,,,,,,,0,,,,,T,terres,,,3309,-0.218883,45.622072
2019-206455,2019-11-18,000001,Vente,333625.3,,,LES GRANDES VERSENNES,B128,16130,16366,Segonzac,16,,,16366000AM0037,,,,,,,,,,,,,0,,,,,T,terres,,,3563,-0.219344,45.622206
2019-206456,2019-10-24,000002,Vente,280000,13,,RUE PIERRE VIALA,0080,16130,16366,Segonzac,16,,,16366000AC0532,,,,,,,,,,,,,0,2,Appartement,82,3,S,sols,,,766,-0.220217,45.616466
2019-206456,2019-10-24,000002,Vente,280000,13,,RUE PIERRE VIALA,0080,16130,16366,Segonzac,16,,,16366000AC0532,,,,,,,,,,,,,0,4,Local industriel. commercial ou assimilé,106,0,S,sols,,,766,-0.220217,45.616466
2019-206456,2019-10-24,000002,Vente,280000,13,,RUE PIERRE VIALA,0080,16130,16366,Segonzac,16,,,16366000AC0532,,,,,,,,,,,,,0,2,Appartement,89,4,S,sols,,,766,-0.220217,45.616466
2019-206456,2019-10-24,000002,Vente,280000,13,,RUE PIERRE VIALA,0080,16130,16366,Segonzac,16,,,16366000AC0532,,,,,,,,,,,,,0,4,Local industriel. commercial ou assimilé,116,0,S,sols,,,766,-0.220217,45.616466
2019-206456,2019-10-24,000002,Vente,280000,13,,RUE PIERRE VIALA,0080,16130,16366,Segonzac,16,,,16366000AC0532,,,,,,,,,,,,,0,4,Local industriel. commercial ou assimilé,60,0,S,sols,,,766,-0.220217,45.616466
2019-206456,2019-10-24,000002,Vente,280000,13,,RUE PIERRE VIALA,0080,16130,16366,Segonzac,16,,,16366000AC0532,,,,,,,,,,,,,0,4,Local industriel. commercial ou assimilé,106,0,S,sols,,,766,-0.220217,45.616466
2019-206456,2019-10-24,000002,Vente,280000,13,,RUE PIERRE VIALA,0080,16130,16366,Segonzac,16,,,16366000AC0532,,,,,,,,,,,,,0,4,Local industriel. commercial ou assimilé,683,0,S,sols,,,766,-0.220217,45.616466
2019-206457,2019-10-30,000002,Echange,11970,,,LES TERRES BLANCHES,B216,16130,16366,Segonzac,16,,,163660000A1017,,,,,,,,,,,,,0,,,,,T,terres,,,4232,-0.232008,45.63875
2019-206457,2019-10-30,000002,Echange,11970,,,MONPRUNEAU,B163,16130,16366,Segonzac,16,,,163660000B0041,,,,,,,,,,,,,0,,,,,T,terres,,,2613,-0.238702,45.63452
2019-206457,2019-10-30,000002,Echange,11970,,,MONPRUNEAU,B163,16130,16366,Segonzac,16,,,163660000B0101,,,,,,,,,,,,,0,,,,,T,terres,,,1800,-0.244539,45.639395
2019-206457,2019-10-30,000002,Echange,11970,,,MONPRUNEAU,B163,16130,16366,Segonzac,16,,,163660000B0103,,,,,,,,,,,,,0,,,,,T,terres,,,1555,-0.24302,45.639733
2019-206457,2019-10-30,000002,Echange,11970,,,MONPRUNEAU,B163,16130,16366,Segonzac,16,,,163660000B0484,,,,,,,,,,,,,0,,,,,T,terres,,,1770,-0.244227,45.639317
2019-206458,2019-10-30,000003,Echange,6845,,,LES GRANDS CHAMPS,B131,16130,16366,Segonzac,16,,,163660000A0273,,,,,,,,,,,,,0,,,,,T,terres,,,2320,-0.238056,45.640764
2019-206459,2019-10-30,000004,Echange,5125,,,LES GRANDS CHAMPS,B131,16130,16366,Segonzac,16,,,163660000A0274,,,,,,,,,,,,,0,,,,,T,terres,,,9650,-0.238128,45.640548
2019-206485,2019-11-06,000001,Vente,162130,12,,RUE REMY DELZONGLE,0095,16130,16366,Segonzac,16,,,16366000AO0027,,,,,,,,,,,,,0,1,Maison,85,3,S,sols,,,500,-0.213754,45.619136