id_mutation,date_mutation,numero_disposition,nature_mutation,valeur_fonciere,adresse_numero,adresse_suffixe,adresse_nom_voie,adresse_code_voie,code_postal,code_commune,nom_commune,code_departement,ancien_code_commune,ancien_nom_commune,id_parcelle,ancien_id_parcelle,numero_volume,lot1_numero,lot1_surface_carrez,lot2_numero,lot2_surface_carrez,lot3_numero,lot3_surface_carrez,lot4_numero,lot4_surface_carrez,lot5_numero,lot5_surface_carrez,nombre_lots,code_type_local,type_local,surface_reelle_bati,nombre_pieces_principales,code_nature_culture,nature_culture,code_nature_culture_speciale,nature_culture_speciale,surface_terrain,longitude,latitude
2019-230382,2019-01-16,000001,Vente,159000,,,LES ESSARTIS,B031,17490,17062,Bresdon,17,,,170620000A0361,,,,,,,,,,,,,0,,,,,J,jardins,,,1122,-0.150136,45.895144
2019-230382,2019-01-16,000001,Vente,159000,,,LES ESSARTIS,B031,17490,17062,Bresdon,17,,,170620000A0362,,,,,,,,,,,,,0,,,,,BT,taillis simples,,,906,-0.14998,45.895204
2019-230382,2019-01-16,000001,Vente,159000,5057,,LES ESSARTIS,B031,17490,17062,Bresdon,17,,,170620000A0823,,,,,,,,,,,,,0,1,Maison,171,5,S,sols,,,1235,-0.149762,45.894945
2019-230382,2019-01-16,000001,Vente,159000,5057,,LES ESSARTIS,B031,17490,17062,Bresdon,17,,,170620000A0823,,,,,,,,,,,,,0,1,Maison,70,2,S,sols,,,1235,-0.149762,45.894945
2019-230382,2019-01-16,000001,Vente,159000,,,LES ESSARTIS,B031,17490,17062,Bresdon,17,,,170620000A0825,,,,,,,,,,,,,0,,,,,T,terres,,,687,-0.149809,45.895207
2019-230687,2019-03-26,000001,Vente,3750,,,LES BELS AIRS,B110,17490,17062,Bresdon,17,,,17062000ZS0056,,,,,,,,,,,,,0,,,,,T,terres,,,6250,-0.139137,45.875218
2019-230868,2019-05-02,000002,Echange,17900,,,SUR FORD,B037,17490,17062,Bresdon,17,,,17062000ZN0038,,,,,,,,,,,,,0,,,,,T,terres,,,7440,-0.156085,45.874945
2019-231077,2019-06-04,000001,Vente,60000,10,,PL CHARLEMAGNE,0014,17490,17062,Bresdon,17,,,170620000B0834,,,,,,,,,,,,,0,1,Maison,53,2,S,sols,,,641,-0.158896,45.876336
2019-231077,2019-06-04,000001,Vente,60000,,,LE BOURG,B008,17490,17062,Bresdon,17,,,170620000B0865,,,,,,,,,,,,,0,,,,,S,sols,,,880,-0.158439,45.876358
2019-231077,2019-06-04,000001,Vente,60000,,,LES CHEVEAUX,B021,17490,17062,Bresdon,17,,,17062000ZN0016,,,,,,,,,,,,,0,,,,,J,jardins,,,600,-0.157717,45.874868
2019-231196,2019-07-03,000001,Vente,87804,,,LES BLANCHARDS,B005,17490,17062,Bresdon,17,,,17062000ZB0004,,,,,,,,,,,,,0,,,,,T,terres,,,1810,-0.165711,45.886301
2019-231196,2019-07-03,000001,Vente,87804,,,LES BLANCHARDS,B005,17490,17062,Bresdon,17,,,17062000ZB0005,,,,,,,,,,,,,0,,,,,VI,vignes,,,2540,-0.165784,45.886152
2019-231196,2019-07-03,000001,Vente,87804,,,LES BLANCHARDS,B005,17490,17062,Bresdon,17,,,17062000ZB0020,,,,,,,,,,,,,0,,,,,VI,vignes,,,2490,-0.160237,45.889015
2019-231196,2019-07-03,000001,Vente,87804,,,LES BLANCHARDS,B005,17490,17062,Bresdon,17,,,17062000ZB0020,,,,,,,,,,,,,0,,,,,T,terres,,,1120,-0.160237,45.889015
2019-231196,2019-07-03,000001,Vente,87804,,,LES BRANCHARDS,B111,17490,17062,Bresdon,17,,,17062000ZO0009,,,,,,,,,,,,,0,,,,,VI,vignes,,,1196,-0.165428,45.883807
2019-231196,2019-07-03,000001,Vente,87804,,,LES BRANCHARDS,B111,17490,17062,Bresdon,17,,,17062000ZO0009,,,,,,,,,,,,,0,,,,,T,terres,,,934,-0.165428,45.883807
2019-231196,2019-07-03,000001,Vente,87804,,,LES BRANCHARDS,B111,17490,17062,Bresdon,17,,,17062000ZO0011,,,,,,,,,,,,,0,,,,,T,terres,,,870,-0.165593,45.884112
2019-231196,2019-07-03,000001,Vente,87804,,,LES BRANCHARDS,B111,17490,17062,Bresdon,17,,,17062000ZO0017,,,,,,,,,,,,,0,,,,,VI,vignes,,,3620,-0.164659,45.884584
2019-231196,2019-07-03,000001,Vente,87804,,,LES BRANCHARDS,B111,17490,17062,Bresdon,17,,,17062000ZO0019,,,,,,,,,,,,,0,,,,,T,terres,,,10210,-0.162558,45.885492
2019-231196,2019-07-03,000001,Vente,87804,,,LES BRANCHARDS,B111,17490,17062,Bresdon,17,,,17062000ZO0019,,,,,,,,,,,,,0,,,,,VI,vignes,,,5230,-0.162558,45.885492
2019-231196,2019-07-03,000001,Vente,87804,,,LES VALLEES,B083,17490,17062,Bresdon,17,,,17062000ZO0037,,,,,,,,,,,,,0,,,,,T,terres,,,38290,-0.156169,45.88258
2019-231196,2019-07-03,000001,Vente,87804,,,LES VALLEES,B083,17490,17062,Bresdon,17,,,17062000ZO0039,,,,,,,,,,,,,0,,,,,T,terres,,,8670,-0.163707,45.881411
2019-231196,2019-07-03,000001,Vente,87804,,,LES VALLEES,B083,17490,17062,Bresdon,17,,,17062000ZO0042,,,,,,,,,,,,,0,,,,,T,terres,,,1080,-0.161744,45.878909
2019-231197,2019-07-03,000001,Vente,5000,15,,RTE DE RANVILLE,0049,17490,17062,Bresdon,17,,,170620000B0490,,,,,,,,,,,,,0,1,Maison,33,1,S,sols,,,180,-0.160319,45.876547
2019-231197,2019-07-03,000001,Vente,5000,,,LE BOURG,B008,17490,17062,Bresdon,17,,,170620000B0494,,,,,,,,,,,,,0,,,,,T,terres,,,1540,-0.160322,45.876919
2019-231197,2019-07-03,000001,Vente,5000,,,LE BOURG,B008,17490,17062,Bresdon,17,,,170620000B0495,,,,,,,,,,,,,0,,,,,S,sols,,,248,-0.16074,45.876911
2019-231197,2019-07-03,000001,Vente,5000,,,LE BOURG,B008,17490,17062,Bresdon,17,,,170620000B0496,,,,,,,,,,,,,0,,,,,T,terres,,,425,-0.160615,45.87705
2019-231562,2019-09-02,000001,Echange,16035,,,SOUFFRETAIN,B076,17490,17062,Bresdon,17,,,170620000C0431,,,,,,,,,,,,,0,,,,,VI,vignes,,,597,-0.118216,45.872114
2019-231562,2019-09-02,000001,Echange,16035,,,SOUFFRETAIN,B076,17490,17062,Bresdon,17,,,170620000C0432,,,,,,,,,,,,,0,,,,,VI,vignes,,,6233,-0.117831,45.872097
2019-231562,2019-09-02,000001,Echange,16035,,,SOUFFRETAIN,B076,17490,17062,Bresdon,17,,,170620000C0435,,,,,,,,,,,,,0,,,,,VI,vignes,,,3452,-0.116732,45.871944
2019-231562,2019-09-02,000001,Echange,16035,,,SOUFFRETAIN,B076,17490,17062,Bresdon,17,,,170620000C0436,,,,,,,,,,,,,0,,,,,VI,vignes,,,8373,-0.115999,45.872305
2019-231562,2019-09-02,000001,Echange,16035,,,SOUFFRETAIN,B076,17490,17062,Bresdon,17,,,170620000C0572,,,,,,,,,,,,,0,,,,,VI,vignes,,,2200,-0.118297,45.872205
2019-231562,2019-09-02,000001,Echange,16035,,,SOUFFRETAIN,B076,17490,17062,Bresdon,17,,,170620000C0573,,,,,,,,,,,,,0,,,,,VI,vignes,,,1700,-0.117604,45.871978
2019-231562,2019-09-02,000001,Echange,16035,,,SOUFFRETAIN,B076,17490,17062,Bresdon,17,,,170620000C0575,,,,,,,,,,,,,0,,,,,VI,vignes,,,9890,-0.117149,45.871942
2019-232149,2019-12-09,000002,Vente,65000,,,VINERVILLE,B087,17490,17062,Bresdon,17,,,170620000D0134,,,,,,,,,,,,,0,,,,,L,landes,FRICH,Friche,39,-0.132498,45.856668
2019-232149,2019-12-09,000002,Vente,65000,,,VINERVILLE,B087,17490,17062,Bresdon,17,,,170620000D1142,,,,,,,,,,,,,0,,,,,S,sols,,,40,-0.132569,45.856586
2019-232149,2019-12-09,000002,Vente,65000,2,A,IMP DES LAURIERS,0030,17490,17062,Bresdon,17,,,170620000D1144,,,,,,,,,,,,,0,3,Dépendance,,0,S,sols,,,30,-0.132635,45.856526
2019-232149,2019-12-09,000002,Vente,65000,6,,IMP DES ERABLES,0021,17490,17062,Bresdon,17,,,170620000D1194,,,,,,,,,,,,,0,1,Maison,136,4,S,sols,,,2401,-0.13224,45.856524
2019-232149,2019-12-09,000002,Vente,65000,2,,IMP DES LAURIERS,0030,17490,17062,Bresdon,17,,,170620000D1196,,,,,,,,,,,,,0,1,Maison,111,4,S,sols,,,434,-0.132663,45.856717
2019-232149,2019-12-09,000002,Vente,65000,,,IMP DES LAURIERS,0030,17490,17062,Bresdon,17,,,170620000D1197,,,,,,,,,,,,,0,,,,,S,sols,,,28,-0.132583,45.856852
2019-232150,2019-12-09,000001,Vente,1000,,,IMP DES ERABLES,0021,17490,17062,Bresdon,17,,,170620000D1195,,,,,,,,,,,,,0,,,,,S,sols,,,336,-0.132386,45.856673
2019-232185,2019-12-16,000002,Echange,60600,,,LES PIERRIERES,B055,17490,17062,Bresdon,17,,,17062000ZB0036,,,,,,,,,,,,,0,,,,,T,terres,,,28150,-0.15522,45.888472
2019-232185,2019-12-16,000002,Echange,60600,,,LES PIERRIERES,B055,17490,17062,Bresdon,17,,,17062000ZB0036,,,,,,,,,,,,,0,,,,,BT,taillis simples,,,7600,-0.15522,45.888472
2019-232185,2019-12-16,000002,Echange,60600,,,LES VIGNEAUX,B084,17490,17062,Bresdon,17,,,17062000ZP0014,,,,,,,,,,,,,0,,,,,T,terres,,,86900,-0.145188,45.884027
2019-232185,2019-12-16,000002,Echange,60600,,,LA PIERRIERE,B054,17490,17062,Bresdon,17,,,17062000ZR0009,,,,,,,,,,,,,0,,,,,T,terres,,,1000,-0.141213,45.882281
2019-232185,2019-12-16,000002,Echange,60600,,,LA PIERRIERE,B054,17490,17062,Bresdon,17,,,17062000ZR0009,,,,,,,,,,,,,0,,,,,VI,vignes,,,2140,-0.141213,45.882281
