id_mutation,date_mutation,numero_disposition,nature_mutation,valeur_fonciere,adresse_numero,adresse_suffixe,adresse_nom_voie,adresse_code_voie,code_postal,code_commune,nom_commune,code_departement,ancien_code_commune,ancien_nom_commune,id_parcelle,ancien_id_parcelle,numero_volume,lot1_numero,lot1_surface_carrez,lot2_numero,lot2_surface_carrez,lot3_numero,lot3_surface_carrez,lot4_numero,lot4_surface_carrez,lot5_numero,lot5_surface_carrez,nombre_lots,code_type_local,type_local,surface_reelle_bati,nombre_pieces_principales,code_nature_culture,nature_culture,code_nature_culture_speciale,nature_culture_speciale,surface_terrain,longitude,latitude
2019-236703,2019-02-01,000001,Vente,1500,,,COURTY,B398,18170,18112,Ids-Saint-Roch,18,,,18112000ZV0018,,,,,,,,,,,,,0,,,,,T,terres,,,6380,2.241535,46.698587
2019-237317,2019-06-18,000001,Vente,36000,,,LAVEAUX,B511,18170,18112,Ids-Saint-Roch,18,,,18112000AY0026,,,,,,,,,,,,,0,,,,,T,terres,,,1601,2.239734,46.702171
2019-237317,2019-06-18,000001,Vente,36000,,,LAVEAUX,B511,18170,18112,Ids-Saint-Roch,18,,,18112000AY0027,,,,,,,,,,,,,0,,,,,J,jardins,,,1077,2.239485,46.702339
2019-237317,2019-06-18,000001,Vente,36000,,,RTE DE LAVEAUX,0100,18170,18112,Ids-Saint-Roch,18,,,18112000AY0028,,,,,,,,,,,,,0,,,,,J,jardins,,,2010,2.239121,46.702446
2019-237317,2019-06-18,000001,Vente,36000,,,LAVEAUX,B511,18170,18112,Ids-Saint-Roch,18,,,18112000AY0031,,,,,,,,,,,,,0,,,,,S,sols,,,425,2.239119,46.702191
2019-237317,2019-06-18,000001,Vente,36000,,,RTE DE LAVEAUX,0100,18170,18112,Ids-Saint-Roch,18,,,18112000AY0032,,,,,,,,,,,,,0,,,,,S,sols,,,396,2.238846,46.702172
2019-237317,2019-06-18,000001,Vente,36000,,,LAVEAUX,B511,18170,18112,Ids-Saint-Roch,18,,,18112000AY0080,,,,,,,,,,,,,0,,,,,S,sols,,,57,2.239512,46.701887
2019-237317,2019-06-18,000001,Vente,36000,,,LAVEAUX,B511,18170,18112,Ids-Saint-Roch,18,,,18112000AY0082,,,,,,,,,,,,,0,,,,,T,terres,,,462,2.239287,46.701784
2019-237317,2019-06-18,000001,Vente,36000,9108,F,RTE DE LAVEAUX,0100,18170,18112,Ids-Saint-Roch,18,,,18112000AY0108,,,,,,,,,,,,,0,1,Maison,74,3,S,sols,,,1047,2.239159,46.701966
2019-237317,2019-06-18,000001,Vente,36000,,,LAVEAUX,B511,18170,18112,Ids-Saint-Roch,18,,,18112000AY0111,,,,,,,,,,,,,0,,,,,S,sols,,,4,2.238962,46.702069
2019-237343,2019-07-04,000001,Vente,17000,211,,LES CHAUMES MONTANDRE,B371,18170,18112,Ids-Saint-Roch,18,,,18112000ZB0104,,,,,,,,,,,,,0,1,Maison,35,1,S,sols,,,114,2.25768,46.727446
2019-237343,2019-07-04,000001,Vente,17000,,,LES CHAUMES MONTANDRE,B371,18170,18112,Ids-Saint-Roch,18,,,18112000ZB0105,,,,,,,,,,,,,0,,,,,T,terres,,,1789,2.257759,46.727273
2019-237436,2019-07-05,000001,Vente,34000,,,ETANG DE BOISROUX,B414,18170,18112,Ids-Saint-Roch,18,,,18112000ZD0020,,,,,,,,,,,,,0,,,,,T,terres,,,24320,2.243054,46.735643
2019-237436,2019-07-05,000001,Vente,34000,,,ETANG DE BOISROUX,B414,18170,18112,Ids-Saint-Roch,18,,,18112000ZD0020,,,,,,,,,,,,,0,,,,,P,prés,,,16810,2.243054,46.735643
2019-237436,2019-07-05,000001,Vente,34000,,,ETANG DE BOISROUX,B414,18170,18112,Ids-Saint-Roch,18,,,18112000ZD0020,,,,,,,,,,,,,0,,,,,E,eaux,PECH,Etangs pêchables,11520,2.243054,46.735643
2019-237546,2019-08-08,000002,Vente,20000,9065,F,RTE DE MORLAC,0300,18170,18112,Ids-Saint-Roch,18,,,18112000AX0065,,,,,,,,,,,,,0,1,Maison,60,2,S,sols,,,376,2.241384,46.707289
2019-237546,2019-08-08,000002,Vente,20000,,,LE BOURG,B050,18170,18112,Ids-Saint-Roch,18,,,18112000AX0259,,,,,,,,,,,,,0,,,,,S,sols,,,139,2.241334,46.707309
2019-237546,2019-08-08,000002,Vente,20000,,,LE BOURG,B050,18170,18112,Ids-Saint-Roch,18,,,18112000AX0261,,,,,,,,,,,,,0,,,,,S,sols,,,2,2.241388,46.707463
2019-238132,2019-12-31,000001,Vente,2000,,,RTE DE LAVEAUX,0100,18170,18112,Ids-Saint-Roch,18,,,18112000AY0062,,,,,,,,,,,,,0,,,,,S,sols,,,129,2.237313,46.702098
