id_mutation,date_mutation,numero_disposition,nature_mutation,valeur_fonciere,adresse_numero,adresse_suffixe,adresse_nom_voie,adresse_code_voie,code_postal,code_commune,nom_commune,code_departement,ancien_code_commune,ancien_nom_commune,id_parcelle,ancien_id_parcelle,numero_volume,lot1_numero,lot1_surface_carrez,lot2_numero,lot2_surface_carrez,lot3_numero,lot3_surface_carrez,lot4_numero,lot4_surface_carrez,lot5_numero,lot5_surface_carrez,nombre_lots,code_type_local,type_local,surface_reelle_bati,nombre_pieces_principales,code_nature_culture,nature_culture,code_nature_culture_speciale,nature_culture_speciale,surface_terrain,longitude,latitude
2019-238487,2019-04-17,000001,Vente,2000,,,LES MARNES,B037,18300,18274,Verdigny,18,,,18274000ZB0012,,,,,,,,,,,,,0,,,,,T,terres,,,2890,2.811081,47.344121
2019-238488,2019-04-17,000002,Vente,33000,,,LES MARNES,B037,18300,18274,Verdigny,18,,,18274000ZB0011,,,,,,,,,,,,,0,,,,,T,terres,,,8340,2.811585,47.343987
2019-238528,2019-04-29,000002,Vente,10905,,,VIGNOBLE DE LA PERRIERE,B063,18300,18274,Verdigny,18,,,182740000C2693,,,,,,,,,,,,,0,,,,,T,terres,,,7270,2.831156,47.343377
2019-238611,2019-05-27,000001,Vente,345000,19,,RTE DES MONTS DAMNES,0028,18300,18274,Verdigny,18,,,18274000ZE0115,,,,,,,,,,,,,0,1,Maison,140,5,VI,vignes,VAOC,Vins d'appellation d'origine contrôlée,4533,2.807223,47.343701
2019-238611,2019-05-27,000001,Vente,345000,19,,RTE DES MONTS DAMNES,0028,18300,18274,Verdigny,18,,,18274000ZE0115,,,,,,,,,,,,,0,1,Maison,140,5,S,sols,,,1207,2.807223,47.343701
2019-238645,2019-06-03,000002,Echange,15475,,,LA BELLE OREILLE,B004,18300,18274,Verdigny,18,,,182740000B1527,,,,,,,,,,,,,0,,,,,VI,vignes,VAOC,Vins d'appellation d'origine contrôlée,1145,2.811985,47.342191
2019-238645,2019-06-03,000002,Echange,15475,,,PICHON,B047,18300,18274,Verdigny,18,,,18274000ZB0547,,,,,,,,,,,,,0,,,,,VI,vignes,VAOC,Vins d'appellation d'origine contrôlée,380,2.808921,47.343274
2019-238645,2019-06-03,000003,Echange,15475,,,LES RENARDIERES,B055,18300,18274,Verdigny,18,,,182740000B1415,,,,,,,,,,,,,0,,,,,VI,vignes,VAOC,Vins d'appellation d'origine contrôlée,735,2.819149,47.342565
2019-238645,2019-06-03,000003,Echange,15475,,,LES RENARDIERES,B055,18300,18274,Verdigny,18,,,182740000B2076,,,,,,,,,,,,,0,,,,,VI,vignes,VAOC,Vins d'appellation d'origine contrôlée,835,2.819088,47.342292
2019-238776,2019-07-04,000001,Vente,155000,35,,RUE DU PRESSOIR,0036,18300,18274,Verdigny,18,,,182740000C2652,,,,,,,,,,,,,0,,,,,T,terres,,,350,2.808003,47.352676
2019-238776,2019-07-04,000001,Vente,155000,35,,RUE DU PRESSOIR,0036,18300,18274,Verdigny,18,,,182740000C2653,,,,,,,,,,,,,0,1,Maison,150,6,T,terres,,,512,2.808146,47.352719
2019-238776,2019-07-04,000001,Vente,155000,35,,RUE DU PRESSOIR,0036,18300,18274,Verdigny,18,,,182740000C2653,,,,,,,,,,,,,0,1,Maison,150,6,S,sols,,,218,2.808146,47.352719
2019-238776,2019-07-04,000001,Vente,155000,5082,,RUE DU PRESSOIR,0036,18300,18274,Verdigny,18,,,18274000ZC0082,,,,,,,,,,,,,0,3,Dépendance,,0,S,sols,,,78,2.807929,47.353087
2019-238776,2019-07-04,000001,Vente,155000,5082,,RUE DU PRESSOIR,0036,18300,18274,Verdigny,18,,,18274000ZC0082,,,,,,,,,,,,,0,3,Dépendance,,0,J,jardins,,,202,2.807929,47.353087
2019-238776,2019-07-04,000001,Vente,155000,,,DERRIERE LE PRESSOIR,B028,18300,18274,Verdigny,18,,,18274000ZC0083,,,,,,,,,,,,,0,,,,,S,sols,,,65,2.807988,47.353106
2019-238776,2019-07-04,000001,Vente,155000,,,DERRIERE LE PRESSOIR,B028,18300,18274,Verdigny,18,,,18274000ZC0083,,,,,,,,,,,,,0,,,,,J,jardins,,,145,2.807988,47.353106
2019-238973,2019-09-13,000001,Vente,170000,7,,RTE DE SAINT SATUR,0044,18300,18274,Verdigny,18,,,182740000C2845,,,,,,,,,,,,,0,1,Maison,98,3,AG,terrains d'agrément,,,2672,2.814623,47.356073
2019-238973,2019-09-13,000001,Vente,170000,7,,RTE DE SAINT SATUR,0044,18300,18274,Verdigny,18,,,182740000C2845,,,,,,,,,,,,,0,1,Maison,98,3,S,sols,,,673,2.814623,47.356073
2019-238973,2019-09-13,000001,Vente,170000,,,LES MARNES DE CHAUDOUX,B066,18300,18274,Verdigny,18,,,182740000C2848,,,,,,,,,,,,,0,,,,,S,sols,,,513,2.81493,47.355634
2019-239090,2019-10-22,000001,Vente,20000,,,LES HATES GOURIS,B034,18300,18274,Verdigny,18,,,18274000ZB0498,,,,,,,,,,,,,0,,,,,AB,terrains a bâtir,,,1018,2.813954,47.349204
2019-239090,2019-10-22,000001,Vente,20000,,,LES HATES GOURIS,B034,18300,18274,Verdigny,18,,,18274000ZB0499,,,,,,,,,,,,,0,,,,,AB,terrains a bâtir,,,1017,2.813786,47.349021
2019-239145,2019-11-06,000001,Vente,150000,8,,CHE MATIFET,0025,18300,18274,Verdigny,18,,,182740000C0638,,,,,,,,,,,,,0,1,Maison,145,5,S,sols,,,1095,2.809969,47.352007
2019-239145,2019-11-06,000001,Vente,150000,6,,CHE MATIFET,0025,18300,18274,Verdigny,18,,,182740000C0639,,,,,,,,,,,,,0,,,,,S,sols,,,1246,2.810313,47.351879
2019-239145,2019-11-06,000001,Vente,150000,6,,CHE MATIFET,0025,18300,18274,Verdigny,18,,,182740000C0640,,,,,,,,,,,,,0,,,,,S,sols,,,500,2.810937,47.351643
2019-239145,2019-11-06,000001,Vente,150000,6,,CHE MATIFET,0025,18300,18274,Verdigny,18,,,182740000C0640,,,,,,,,,,,,,0,,,,,T,terres,,,590,2.810937,47.351643
2019-239145,2019-11-06,000001,Vente,150000,,,LES PATUREAUX,B044,18300,18274,Verdigny,18,,,182740000C0641,,,,,,,,,,,,,0,,,,,T,terres,,,1213,2.810955,47.351427
