id_mutation,date_mutation,numero_disposition,nature_mutation,valeur_fonciere,adresse_numero,adresse_suffixe,adresse_nom_voie,adresse_code_voie,code_postal,code_commune,nom_commune,code_departement,ancien_code_commune,ancien_nom_commune,id_parcelle,ancien_id_parcelle,numero_volume,lot1_numero,lot1_surface_carrez,lot2_numero,lot2_surface_carrez,lot3_numero,lot3_surface_carrez,lot4_numero,lot4_surface_carrez,lot5_numero,lot5_surface_carrez,nombre_lots,code_type_local,type_local,surface_reelle_bati,nombre_pieces_principales,code_nature_culture,nature_culture,code_nature_culture_speciale,nature_culture_speciale,surface_terrain,longitude,latitude
2019-239655,2019-02-14,000001,Vente,5735,,,LES BESSES,B002,19200,19232,Saint-Pardoux-le-Neuf,19,,,19232000ZH0071,,,,,,,,,,,,,0,,,,,L,landes,,,1147,2.319932,45.603585
2019-241204,2019-08-21,000001,Vente,60000,10,,LE BOURG,B011,19200,19232,Saint-Pardoux-le-Neuf,19,,,19232000ZI0020,,,,,,,,,,,,,0,1,Maison,70,2,S,sols,,,235,2.328464,45.612229
2019-241204,2019-08-21,000001,Vente,60000,,,LE BOURG,B011,19200,19232,Saint-Pardoux-le-Neuf,19,,,19232000ZI0021,,,,,,,,,,,,,0,,,,,J,jardins,,,510,2.32866,45.612181
2019-241204,2019-08-21,000001,Vente,60000,,,LE BOURG,B011,19200,19232,Saint-Pardoux-le-Neuf,19,,,19232000ZI0022,,,,,,,,,,,,,0,,,,,S,sols,,,100,2.328696,45.612401
2019-241204,2019-08-21,000001,Vente,60000,,,LE BOURG,B011,19200,19232,Saint-Pardoux-le-Neuf,19,,,19232000ZI0022,,,,,,,,,,,,,0,,,,,P,prés,,,915,2.328696,45.612401
2019-241213,2019-08-14,000001,Vente,81000,,,LE COUDERT,B018,19200,19232,Saint-Pardoux-le-Neuf,19,,,19232000ZA0037,,,,,,,,,,,,,0,,,,,S,sols,,,335,2.327585,45.632087
2019-241213,2019-08-14,000001,Vente,81000,5058,,LA LAUBIE,B024,19200,19232,Saint-Pardoux-le-Neuf,19,,,19232000ZA0063,,,,,,,,,,,,,0,1,Maison,68,3,T,terres,,,1400,2.32739,45.632301
2019-241213,2019-08-14,000001,Vente,81000,5058,,LA LAUBIE,B024,19200,19232,Saint-Pardoux-le-Neuf,19,,,19232000ZA0063,,,,,,,,,,,,,0,1,Maison,68,3,S,sols,,,1764,2.32739,45.632301
2019-241213,2019-08-14,000001,Vente,81000,5058,,LA LAUBIE,B024,19200,19232,Saint-Pardoux-le-Neuf,19,,,19232000ZA0063,,,,,,,,,,,,,0,1,Maison,68,3,BF,futaies feuillues,,,7177,2.32739,45.632301
2019-241823,2019-10-24,000002,Vente,50,29,,LES BESSES,B002,19200,19232,Saint-Pardoux-le-Neuf,19,,,19232000ZH0047,,,,,,,,,,,,,0,1,Maison,70,1,,,,,,2.319605,45.602643
2019-241863,2019-10-30,000001,Vente,85000,,,LES BESSES,B002,19200,19232,Saint-Pardoux-le-Neuf,19,,,19232000ZH0011,,,,,,,,,,,,,0,,,,,T,terres,,,400,2.319158,45.602739
2019-241863,2019-10-30,000001,Vente,85000,,,LES BESSES,B002,19200,19232,Saint-Pardoux-le-Neuf,19,,,19232000ZH0028,,,,,,,,,,,,,0,,,,,P,prés,,,470,2.319593,45.602366
2019-241863,2019-10-30,000001,Vente,85000,,,LES BESSES,B002,19200,19232,Saint-Pardoux-le-Neuf,19,,,19232000ZH0038,,,,,,,,,,,,,0,,,,,S,sols,,,198,2.319245,45.60262
2019-241863,2019-10-30,000001,Vente,85000,,,LES BESSES,B002,19200,19232,Saint-Pardoux-le-Neuf,19,,,19232000ZH0043,,,,,,,,,,,,,0,,,,,S,sols,,,49,2.319335,45.602544
2019-241863,2019-10-30,000001,Vente,85000,31,,LES BESSES,B002,19200,19232,Saint-Pardoux-le-Neuf,19,,,19232000ZH0044,,,,,,,,,,,,,0,1,Maison,82,4,S,sols,,,621,2.31957,45.602566
2019-241863,2019-10-30,000001,Vente,85000,,,LES BESSES,B002,19200,19232,Saint-Pardoux-le-Neuf,19,,,19232000ZH0047,,,,,,,,,,,,,0,,,,,AG,terrains d'agrément,PARC,Parc,48,2.319605,45.602643
