id_mutation,date_mutation,numero_disposition,nature_mutation,valeur_fonciere,adresse_numero,adresse_suffixe,adresse_nom_voie,adresse_code_voie,code_postal,code_commune,nom_commune,code_departement,ancien_code_commune,ancien_nom_commune,id_parcelle,ancien_id_parcelle,numero_volume,lot1_numero,lot1_surface_carrez,lot2_numero,lot2_surface_carrez,lot3_numero,lot3_surface_carrez,lot4_numero,lot4_surface_carrez,lot5_numero,lot5_surface_carrez,nombre_lots,code_type_local,type_local,surface_reelle_bati,nombre_pieces_principales,code_nature_culture,nature_culture,code_nature_culture_speciale,nature_culture_speciale,surface_terrain,longitude,latitude
2019-252650,2019-10-05,000002,Vente,1,,,LES OUCHES,B056,21230,21015,Antigny-la-Ville,21,,,210150000B0538,,,,,,,,,,,,,0,,,,,T,terres,,,229,4.556132,47.100297
2019-252682,2019-10-05,000001,Vente,18000,,,LES OUCHES,B056,21230,21015,Antigny-la-Ville,21,,,210150000B0210,,,,,,,,,,,,,0,,,,,P,prés,,,1761,4.55639,47.100309
2019-252682,2019-10-05,000001,Vente,18000,,,LES OUCHES,B056,21230,21015,Antigny-la-Ville,21,,,210150000B0538,,,,,,,,,,,,,0,,,,,T,terres,,,229,4.556132,47.100297
2019-258855,2019-04-10,000002,Vente,1800,,,AU TILLOT,B100,21230,21015,Antigny-la-Ville,21,,,210150000D0363,,,,,,,,,,,,,0,,,,,PA,pâtures,,,1199,4.557562,47.096927
2019-258856,2019-04-10,000001,Vente,600,,,LE VILLAGE,B107,21230,21015,Antigny-la-Ville,21,,,210150000B0138,,,,,,,,,,,,,0,,,,,S,sols,,,131,,
2019-259869,2019-07-26,000001,Vente,76500,2,,RUE DES CHENEVIERES,0030,21230,21015,Antigny-la-Ville,21,,,210150000B0155,,,,,,,,,,,,,0,1,Maison,39,2,S,sols,,,64,4.55841,47.100971
2019-259869,2019-07-26,000001,Vente,76500,4,,RUE DES CHENEVIERES,0030,21230,21015,Antigny-la-Ville,21,,,210150000B0156,,,,,,,,,,,,,0,1,Maison,117,4,S,sols,,,92,4.558121,47.100982
2019-259869,2019-07-26,000001,Vente,76500,,,LE VILLAGE,B107,21230,21015,Antigny-la-Ville,21,,,210150000B0157,,,,,,,,,,,,,0,,,,,S,sols,,,326,4.558307,47.101028
2019-259869,2019-07-26,000001,Vente,76500,,,LE VILLAGE,B107,21230,21015,Antigny-la-Ville,21,,,210150000B0158,,,,,,,,,,,,,0,,,,,S,sols,,,194,4.558282,47.101196
2019-259869,2019-07-26,000001,Vente,76500,,,LE VILLAGE,B107,21230,21015,Antigny-la-Ville,21,,,210150000B0159,,,,,,,,,,,,,0,,,,,S,sols,,,250,4.558151,47.101135
