id_mutation,date_mutation,numero_disposition,nature_mutation,valeur_fonciere,adresse_numero,adresse_suffixe,adresse_nom_voie,adresse_code_voie,code_postal,code_commune,nom_commune,code_departement,ancien_code_commune,ancien_nom_commune,id_parcelle,ancien_id_parcelle,numero_volume,lot1_numero,lot1_surface_carrez,lot2_numero,lot2_surface_carrez,lot3_numero,lot3_surface_carrez,lot4_numero,lot4_surface_carrez,lot5_numero,lot5_surface_carrez,nombre_lots,code_type_local,type_local,surface_reelle_bati,nombre_pieces_principales,code_nature_culture,nature_culture,code_nature_culture_speciale,nature_culture_speciale,surface_terrain,longitude,latitude
2019-252593,2019-09-30,000001,Vente,112000,310,,RUE D AMONT,0020,21250,21112,Broin,21,,,211120000A0757,,,,,,,,,,,,,0,1,Maison,70,3,S,sols,,,1605,5.108431,47.082376
2019-252593,2019-09-30,000001,Vente,112000,,,VIGNES DU CRAS,B159,21250,21112,Broin,21,,,211120000A1091,,,,,,,,,,,,,0,,,,,S,sols,,,42,5.10872,47.08233
2019-252639,2019-10-09,000001,Vente,210500,222,,RUE DU MOULIN A VENT,0145,21250,21112,Broin,21,,,211120000C0793,,,,,,,,,,,,,0,1,Maison,86,4,S,sols,,,500,5.107577,47.077011
2019-252639,2019-10-09,000001,Vente,210500,222,,RUE DU MOULIN A VENT,0145,21250,21112,Broin,21,,,211120000C0793,,,,,,,,,,,,,0,1,Maison,86,4,J,jardins,,,1130,5.107577,47.077011
2019-254127,2019-10-25,000001,Vente,152000,,,VIGNES DE LA RUE DAMONT,B158,21250,21112,Broin,21,,,211120000A0982,,,,,,,,,,,,,0,,,,,S,sols,,,2,5.110404,47.086821
2019-254127,2019-10-25,000001,Vente,152000,,,VIGNES DE LA RUE DAMONT,B158,21250,21112,Broin,21,,,211120000A0987,,,,,,,,,,,,,0,,,,,S,sols,,,72,5.111217,47.086575
2019-254127,2019-10-25,000001,Vente,152000,60,,LOT AU CHENE ROND,A100,21250,21112,Broin,21,,,211120000A0991,,,,,,,,,,,,,0,1,Maison,87,4,S,sols,,,492,5.110859,47.086456
2019-254127,2019-10-25,000001,Vente,152000,,,VIGNES DE LA RUE DAMONT,B158,21250,21112,Broin,21,,,211120000A0992,,,,,,,,,,,,,0,,,,,S,sols,,,210,5.110732,47.086449
2019-254127,2019-10-25,000001,Vente,152000,,,VIGNES DE LA RUE DAMONT,B158,21250,21112,Broin,21,,,211120000A0995,,,,,,,,,,,,,0,,,,,S,sols,,,620,5.110867,47.08662
2019-254436,2019-11-18,000001,Vente,120000,95,,LOT EN LA VESVRE,A200,21250,21112,Broin,21,,,211120000D0513,,,,,,,,,,,,,0,1,Maison,73,4,S,sols,,,277,5.106138,47.083328
2019-254436,2019-11-18,000001,Vente,120000,95,,LOT EN LA VESVRE,A200,21250,21112,Broin,21,,,211120000D0513,,,,,,,,,,,,,0,1,Maison,73,4,J,jardins,,,585,5.106138,47.083328
2019-254528,2019-11-08,000001,Vente,270,,,VIGNES DE LA RUE DAMONT,B158,21250,21112,Broin,21,,,211120000A0493,,,,,,,,,,,,,0,,,,,T,terres,,,268,5.11001,47.083814
2019-254528,2019-11-08,000001,Vente,270,,,VIGNES DE LA RUE DAMONT,B158,21250,21112,Broin,21,,,211120000A0493,,,,,,,,,,,,,0,,,,,T,terres,,,267,5.11001,47.083814
2019-254528,2019-11-08,000001,Vente,270,,,SUR LES COMBES,B033,21250,21112,Broin,21,,,21112000ZB0033,,,,,,,,,,,,,0,,,,,T,terres,,,545,5.117855,47.084229
2019-254950,2019-11-22,000001,Vente,826.5,,,VIGNES DE LA RUE DAMONT,B158,21250,21112,Broin,21,,,211120000A0510,,,,,,,,,,,,,0,,,,,T,terres,,,2755,5.110398,47.082901
2019-254953,2019-11-29,000001,Echange,300,,,EN LA GUIGUENNE,B086,21250,21112,Broin,21,,,21112000ZA0153,,,,,,,,,,,,,0,,,,,BT,taillis simples,,,1675,5.099453,47.077368
2019-254953,2019-11-29,000002,Echange,300,,,GRANDES FOLIES,B078,21250,21112,Broin,21,,,21112000ZA0133,,,,,,,,,,,,,0,,,,,BT,taillis simples,ACACI,Acacias,1162,5.096669,47.079213
2019-254953,2019-11-29,000002,Echange,300,,,GRANDES FOLIES,B078,21250,21112,Broin,21,,,21112000ZA0134,,,,,,,,,,,,,0,,,,,BT,taillis simples,ACACI,Acacias,490,5.096762,47.079183
2019-255119,2019-11-29,000001,Vente,6400,,,AU DESSUS DU POIRIER DE CH,B056,21250,21112,Broin,21,,,211120000A0272,,,,,,,,,,,,,0,,,,,T,terres,,,1460,5.119506,47.081506
2019-255119,2019-11-29,000001,Vente,6400,,,LA CHAPELLE,B024,21250,21112,Broin,21,,,211120000A0389,,,,,,,,,,,,,0,,,,,L,landes,,,5290,5.121247,47.081525
2019-255119,2019-11-29,000001,Vente,6400,,,LA CHAPELLE,B024,21250,21112,Broin,21,,,211120000A0395,,,,,,,,,,,,,0,,,,,T,terres,,,1810,5.12135,47.081856
2019-255119,2019-11-29,000001,Vente,6400,,,EN LA COUR,B044,21250,21112,Broin,21,,,211120000A0404,,,,,,,,,,,,,0,,,,,T,terres,,,400,5.118825,47.081447
2019-255119,2019-11-29,000001,Vente,6400,,,LE POIRIER DE CHAT,B119,21250,21112,Broin,21,,,211120000A0430,,,,,,,,,,,,,0,,,,,T,terres,,,695,5.118066,47.081168
2019-255119,2019-11-29,000001,Vente,6400,,,EN LA COUR,B044,21250,21112,Broin,21,,,211120000A0921,,,,,,,,,,,,,0,,,,,T,terres,,,7620,5.119018,47.08117
2019-255119,2019-11-29,000001,Vente,6400,,,AU CHENE ROND,B029,21250,21112,Broin,21,,,21112000ZC0026,,,,,,,,,,,,,0,,,,,T,terres,,,8285,5.112333,47.089352
2019-255295,2019-12-13,000001,Vente,40000,,,PRES AUX OIES,B135,21250,21112,Broin,21,,,21112000ZD0086,,,,,,,,,,,,,0,,,,,T,terres,,,3040,5.11982,47.074841
2019-255295,2019-12-13,000001,Vente,40000,,,PRES AUX OIES,B135,21250,21112,Broin,21,,,21112000ZD0087,,,,,,,,,,,,,0,,,,,T,terres,,,22320,5.119033,47.075239
2019-256043,2019-11-28,000001,Vente,30000,,,LA PELOUZEE,B104,21250,21112,Broin,21,,,211120000C0266,,,,,,,,,,,,,0,,,,,BT,taillis simples,ACACI,Acacias,690,5.11264,47.075851
2019-256043,2019-11-28,000001,Vente,30000,191,,RUE DU CHATEAU,0080,21250,21112,Broin,21,,,211120000C0267,,,,,,,,,,,,,0,1,Maison,171,5,T,terres,,,363,5.112522,47.075767
2019-256043,2019-11-28,000001,Vente,30000,191,,RUE DU CHATEAU,0080,21250,21112,Broin,21,,,211120000C0267,,,,,,,,,,,,,0,1,Maison,171,5,S,sols,,,302,5.112522,47.075767
2019-256043,2019-11-28,000001,Vente,30000,,,LA PELOUZEE,B104,21250,21112,Broin,21,,,211120000C0268,,,,,,,,,,,,,0,,,,,VI,vignes,,,555,5.112577,47.075663
2019-256485,2019-12-17,000001,Vente,5553.25,,,EN LA MANCHE,B090,21250,21112,Broin,21,,,21112000ZB0006,,,,,,,,,,,,,0,,,,,T,terres,,,3005,5.113222,47.085091
2019-256485,2019-12-17,000001,Vente,5553.25,,,EN ESSERTIN,B060,21250,21112,Broin,21,,,21112000ZB0129,,,,,,,,,,,,,0,,,,,T,terres,,,4104,5.102256,47.080445
2019-256485,2019-12-17,000001,Vente,5553.25,,,EN ESSERTIN,B060,21250,21112,Broin,21,,,21112000ZB0129,,,,,,,,,,,,,0,,,,,T,terres,,,4104,5.102256,47.080445
2019-256485,2019-12-17,000001,Vente,5553.25,,,AU CHENE ROND,B029,21250,21112,Broin,21,,,21112000ZC0031,,,,,,,,,,,,,0,,,,,T,terres,,,6800,5.114045,47.089607
2019-256485,2019-12-17,000001,Vente,5553.25,,,AU CHENE ROND,B029,21250,21112,Broin,21,,,21112000ZC0031,,,,,,,,,,,,,0,,,,,T,terres,,,3400,5.114045,47.089607
2019-256485,2019-12-17,000001,Vente,5553.25,,,LA FAMINE,B063,21250,21112,Broin,21,,,21112000ZC0104,,,,,,,,,,,,,0,,,,,T,terres,,,800,5.116383,47.089115
2019-258266,2019-02-08,000002,Vente,31500,,,LE VILLAGE,B160,21250,21112,Broin,21,,,211120000A1143,,,,,,,,,,,,,0,,,,,P,prés,,,2188,5.111133,47.078525
2019-258287,2019-02-11,000001,Vente,430,,,LE TERTRE DES ANGES,B148,21250,21112,Broin,21,,,211120000C0405,,,,,,,,,,,,,0,,,,,T,terres,,,250,5.111932,47.074098
2019-258287,2019-02-11,000001,Vente,430,,,LE TERTRE DES ANGES,B148,21250,21112,Broin,21,,,211120000C0406,,,,,,,,,,,,,0,,,,,T,terres,,,650,5.112057,47.074152
2019-258287,2019-02-11,000001,Vente,430,,,LE TERTRE DES ANGES,B148,21250,21112,Broin,21,,,211120000C0411,,,,,,,,,,,,,0,,,,,VI,vignes,,,325,5.11215,47.074329
2019-258287,2019-02-11,000001,Vente,430,,,LE TERTRE DES ANGES,B148,21250,21112,Broin,21,,,211120000C0764,,,,,,,,,,,,,0,,,,,T,terres,,,209,5.112566,47.074116
2019-258288,2019-02-11,000001,Vente,233,,,VIGNES DE LA RUE DAMONT,B158,21250,21112,Broin,21,,,211120000A0480,,,,,,,,,,,,,0,,,,,T,terres,,,335,5.109783,47.084537
2019-258288,2019-02-11,000001,Vente,233,,,VIGNES DE LA RUE DAMONT,B158,21250,21112,Broin,21,,,211120000A0482,,,,,,,,,,,,,0,,,,,T,terres,,,440,5.110067,47.084374
2019-258289,2019-02-11,000001,Vente,1555,,,LE POIRIER DE CHAT,B119,21250,21112,Broin,21,,,211120000A0432,,,,,,,,,,,,,0,,,,,T,terres,,,797,5.117825,47.081264
2019-258289,2019-02-11,000001,Vente,1555,,,LE POIRIER DE CHAT,B119,21250,21112,Broin,21,,,211120000A0432,,,,,,,,,,,,,0,,,,,T,terres,,,798,5.117825,47.081264
2019-258289,2019-02-11,000001,Vente,1555,,,AU CERISIER,B021,21250,21112,Broin,21,,,21112000ZC0092,,,,,,,,,,,,,0,,,,,T,terres,,,3590,5.119325,47.088255
2019-258291,2019-02-11,000001,Vente,7842,,,LA NOLEUTE,B103,21250,21112,Broin,21,,,211120000C0088,,,,,,,,,,,,,0,,,,,T,terres,,,995,5.119057,47.079241
2019-258291,2019-02-11,000001,Vente,7842,,,AU BAS DE NALAS,B008,21250,21112,Broin,21,,,211120000C0113,,,,,,,,,,,,,0,,,,,L,landes,,,353,5.117639,47.078141
2019-258291,2019-02-11,000001,Vente,7842,,,AU BAS DE NALAS,B008,21250,21112,Broin,21,,,211120000C0115,,,,,,,,,,,,,0,,,,,T,terres,,,508,5.117631,47.077825
2019-258291,2019-02-11,000001,Vente,7842,,,VERS LA PLANTE MAGNIEN,B155,21250,21112,Broin,21,,,21112000ZA0049,,,,,,,,,,,,,0,,,,,T,terres,,,1570,5.108368,47.074096
2019-258291,2019-02-11,000001,Vente,7842,,,LA GRANDE CORVEE,B074,21250,21112,Broin,21,,,21112000ZA0163,,,,,,,,,,,,,0,,,,,T,terres,,,2846,5.102006,47.072272
2019-258291,2019-02-11,000001,Vente,7842,,,LA COTTE,B043,21250,21112,Broin,21,,,21112000ZC0084,,,,,,,,,,,,,0,,,,,T,terres,,,11825,5.119,47.090167
2019-258291,2019-02-11,000001,Vente,7842,,,AU CHENE CHATEAU,B027,21250,21112,Broin,21,,,21112000ZC0135,,,,,,,,,,,,,0,,,,,T,terres,,,4527,5.10988,47.09088
2019-258291,2019-02-11,000001,Vente,7842,,,PETITS ESSARTS,B111,21250,21112,Broin,21,,,21112000ZD0021,,,,,,,,,,,,,0,,,,,T,terres,,,995,5.131028,47.071864
2019-258291,2019-02-11,000001,Vente,7842,,,PETITS ESSARTS,B111,21250,21112,Broin,21,,,21112000ZD0022,,,,,,,,,,,,,0,,,,,T,terres,,,2520,5.131327,47.071842
2019-258292,2019-02-11,000001,Vente,4507,,,EN CHATAIGNER,B026,21250,21112,Broin,21,,,211120000A0562,,,,,,,,,,,,,0,,,,,BO,oseraies,,,310,5.111496,47.083429
2019-258292,2019-02-11,000001,Vente,4507,,,LES GRANDES VIGNES,B080,21250,21112,Broin,21,,,211120000C0358,,,,,,,,,,,,,0,,,,,T,terres,,,745,5.110458,47.074636
2019-258292,2019-02-11,000001,Vente,4507,,,LA CORVIOTTE,B042,21250,21112,Broin,21,,,21112000ZA0072,,,,,,,,,,,,,0,,,,,T,terres,,,3475,5.103244,47.073472
2019-258292,2019-02-11,000001,Vente,4507,,,BOIS DE BROIN,B017,21250,21112,Broin,21,,,21112000ZC0021,,,,,,,,,,,,,0,,,,,T,terres,,,7850,5.111751,47.09197
2019-258292,2019-02-11,000001,Vente,4507,,,LE GRAND TACON,B073,21250,21112,Broin,21,,,21112000ZE0007,,,,,,,,,,,,,0,,,,,T,terres,,,2645,5.12494,47.067163
2019-258432,2019-02-04,000001,Echange,300,,,LA NOLEUTE,B103,21250,21112,Broin,21,,,211120000C0074,,,,,,,,,,,,,0,,,,,VE,vergers,,,385,5.117016,47.079776
2019-258433,2019-02-04,000002,Echange,730,,,LES TRENTE SOITURES,B150,21250,21112,Broin,21,,,21112000ZD0056,,,,,,,,,,,,,0,,,,,T,terres,,,3135,5.12605,47.068641
2019-259019,2019-05-06,000001,Vente,2190,,,AU CHENE CHATEAU,B027,21250,21112,Broin,21,,,211120000A0798,,,,,,,,,,,,,0,,,,,T,terres,,,8110,5.113774,47.088656
2019-259370,2019-06-25,000001,Vente,5000,,,MEIX SABARD,B097,21250,21112,Broin,21,,,211120000D0205,,,,,,,,,,,,,0,,,,,T,terres,,,1105,5.109212,47.085711
2019-259492,2019-07-05,000001,Vente,875,,,LA MARE MEUNIERE,B093,21250,21112,Broin,21,,,211120000A0407,,,,,,,,,,,,,0,,,,,T,terres,,,1640,5.118362,47.080554
2019-259492,2019-07-05,000001,Vente,875,,,AU DESSUS DU POIRIER DU CH,B057,21250,21112,Broin,21,,,21112000ZB0048,,,,,,,,,,,,,0,,,,,T,terres,,,820,5.119277,47.082225
2019-259579,2019-06-28,000001,Vente,167000,5171,,RUE DU CRAS,0095,21250,21112,Broin,21,,,211120000A1097,,,,,,,,,,,,,0,3,Dépendance,,0,S,sols,,,220,5.108956,47.0802
2019-259579,2019-06-28,000001,Vente,167000,,,LE VILLAGE,B160,21250,21112,Broin,21,,,211120000A1099,,,,,,,,,,,,,0,,,,,J,jardins,,,391,5.108549,47.080316
2019-259579,2019-06-28,000001,Vente,167000,103,,RUE DU CRAS,0095,21250,21112,Broin,21,,,211120000A1100,,,,,,,,,,,,,0,1,Maison,117,3,J,jardins,,,54,5.108655,47.080179
2019-259579,2019-06-28,000001,Vente,167000,103,,RUE DU CRAS,0095,21250,21112,Broin,21,,,211120000A1100,,,,,,,,,,,,,0,1,Maison,117,3,S,sols,,,500,5.108655,47.080179
2019-259579,2019-06-28,000001,Vente,167000,,,LE VILLAGE,B160,21250,21112,Broin,21,,,211120000A1104,,,,,,,,,,,,,0,,,,,J,jardins,,,35,5.108414,47.080199
2019-260065,2019-09-05,000001,Vente,193100,,,VIGNES DE LA RUE DAMONT,B158,21250,21112,Broin,21,,,211120000A0982,,,,,,,,,,,,,0,,,,,S,sols,,,2,5.110404,47.086821
2019-260065,2019-09-05,000001,Vente,193100,,,VIGNES DE LA RUE DAMONT,B158,21250,21112,Broin,21,,,211120000A0987,,,,,,,,,,,,,0,,,,,S,sols,,,72,5.111217,47.086575
2019-260065,2019-09-05,000001,Vente,193100,,,VIGNES DE LA RUE DAMONT,B158,21250,21112,Broin,21,,,211120000A0995,,,,,,,,,,,,,0,,,,,S,sols,,,620,5.110867,47.08662
2019-260065,2019-09-05,000001,Vente,193100,,,AU DESSUS DE LA MANCHE,B055,21250,21112,Broin,21,,,211120000A1011,,,,,,,,,,,,,0,,,,,S,sols,,,326,5.110816,47.08693
2019-260065,2019-09-05,000001,Vente,193100,,,AU DESSUS DE LA MANCHE,B055,21250,21112,Broin,21,,,211120000A1013,,,,,,,,,,,,,0,,,,,S,sols,,,254,5.110883,47.087
2019-260065,2019-09-05,000001,Vente,193100,,,AU DESSUS DE LA MANCHE,B055,21250,21112,Broin,21,,,211120000A1046,,,,,,,,,,,,,0,,,,,S,sols,,,151,5.110907,47.087033
2019-260065,2019-09-05,000001,Vente,193100,25,,LOT AU CHENE ROND,A100,21250,21112,Broin,21,,,211120000A1069,,,,,,,,,,,,,0,1,Maison,79,2,S,sols,,,732,5.11055,47.086831
