id_mutation,date_mutation,numero_disposition,nature_mutation,valeur_fonciere,adresse_numero,adresse_suffixe,adresse_nom_voie,adresse_code_voie,code_postal,code_commune,nom_commune,code_departement,ancien_code_commune,ancien_nom_commune,id_parcelle,ancien_id_parcelle,numero_volume,lot1_numero,lot1_surface_carrez,lot2_numero,lot2_surface_carrez,lot3_numero,lot3_surface_carrez,lot4_numero,lot4_surface_carrez,lot5_numero,lot5_surface_carrez,nombre_lots,code_type_local,type_local,surface_reelle_bati,nombre_pieces_principales,code_nature_culture,nature_culture,code_nature_culture_speciale,nature_culture_speciale,surface_terrain,longitude,latitude
2019-246016,2019-01-21,000001,Vente,15000,,,BOUTENIER,B009,21220,21523,Reulle-Vergy,21,,,215230000A0247,,,,,,,,,,,,,0,,,,,L,landes,,,224,4.89594,47.187365
2019-246016,2019-01-21,000001,Vente,15000,,,LE VILLAGE,B082,21220,21523,Reulle-Vergy,21,,,21523000AB0085,,,,,,,,,,,,,0,,,,,S,sols,,,149,4.895787,47.187114
2019-247590,2019-04-04,000001,Vente,923,,,LA VIOLETTE,B083,21220,21523,Reulle-Vergy,21,,,21523000ZD0083,,,,,,,,,,,,,0,,,,,T,terres,,,923,,
2019-254307,2019-10-31,000001,Vente,215,,,LE VILLAGE,B082,21220,21523,Reulle-Vergy,21,,,21523000AB0003,,,,,,,,,,,,,0,,,,,T,terres,,,428,4.893222,47.188258
2019-255285,2019-11-26,000001,Vente,10000,,,CHAMPS COURBES,B015,21220,21523,Reulle-Vergy,21,,,21523000ZD0052,,,,,,,,,,,,,0,,,,,VI,vignes,,,1565,4.897727,47.184003
2019-255285,2019-11-26,000001,Vente,10000,,,CHAMPS COURBES,B015,21220,21523,Reulle-Vergy,21,,,21523000ZD0052,,,,,,,,,,,,,0,,,,,J,jardins,,,476,4.897727,47.184003
2019-255285,2019-11-26,000001,Vente,10000,,,CHAMPS COURBES,B015,21220,21523,Reulle-Vergy,21,,,21523000ZD0052,,,,,,,,,,,,,0,,,,,T,terres,,,693,4.897727,47.184003
2019-255285,2019-11-26,000001,Vente,10000,,,COMBE ROSE,B042,21220,21523,Reulle-Vergy,21,,,21523000ZD0072,,,,,,,,,,,,,0,,,,,VI,vignes,,,3285,4.895602,47.182155
