id_mutation,date_mutation,numero_disposition,nature_mutation,valeur_fonciere,adresse_numero,adresse_suffixe,adresse_nom_voie,adresse_code_voie,code_postal,code_commune,nom_commune,code_departement,ancien_code_commune,ancien_nom_commune,id_parcelle,ancien_id_parcelle,numero_volume,lot1_numero,lot1_surface_carrez,lot2_numero,lot2_surface_carrez,lot3_numero,lot3_surface_carrez,lot4_numero,lot4_surface_carrez,lot5_numero,lot5_surface_carrez,nombre_lots,code_type_local,type_local,surface_reelle_bati,nombre_pieces_principales,code_nature_culture,nature_culture,code_nature_culture_speciale,nature_culture_speciale,surface_terrain,longitude,latitude
2019-252432,2019-09-19,000001,Vente,15041,,,VILLAGE EST,B030,21530,21531,Rouvray,21,,,21531000AC0446,,,,,,,,,,,,,0,,,,,AB,terrains a bâtir,,,1157,4.111894,47.422973
2019-253754,2019-10-29,000001,Vente,35000,14,,RUE VANNOISE,0700,21530,21531,Rouvray,21,,,21531000AC0040,,,,,,,,,,,,,0,1,Maison,62,3,S,sols,,,159,4.102906,47.423167
2019-253754,2019-10-29,000001,Vente,35000,9220,,RUE DE SAINT ANDEUX,0650,21530,21531,Rouvray,21,,,21531000AC0291,,,,,,,,,,,,,0,3,Dépendance,,0,S,sols,,,61,4.104354,47.422351
2019-254142,2019-11-06,000001,Vente,24542,106,,RUE DU GENERAL LECLERC,0380,21530,21531,Rouvray,21,,,21531000AC0206,,,,,,,,,,,,,0,1,Maison,60,3,S,sols,,,319,4.110709,47.423902
2019-260296,2019-02-07,000001,Vente,13000,,,MURGER BOUILLOT,B020,21530,21531,Rouvray,21,,,215310000A0125,,,,,,,,,,,,,0,,,,,P,prés,,,24480,4.095294,47.421987
2019-260296,2019-02-07,000001,Vente,13000,,,LES GENIEVRES,B017,21530,21531,Rouvray,21,,,215310000B0236,,,,,,,,,,,,,0,,,,,P,prés,,,23980,4.10778,47.415718
2019-260296,2019-02-07,000001,Vente,13000,,,LES CORNUES,B007,21530,21531,Rouvray,21,,,215310000B0274,,,,,,,,,,,,,0,,,,,P,prés,,,38046,4.109155,47.419248
2019-260600,2019-05-25,000001,Vente,65000,55,,RUE DU GENERAL LECLERC,0380,21530,21531,Rouvray,21,,,21531000AC0126,,,,,,,,,,,,,0,4,Local industriel. commercial ou assimilé,128,0,S,sols,,,1103,4.106271,47.42476
2019-260600,2019-05-25,000001,Vente,65000,55,,RUE DU GENERAL LECLERC,0380,21530,21531,Rouvray,21,,,21531000AC0126,,,,,,,,,,,,,0,1,Maison,135,6,S,sols,,,1103,4.106271,47.42476
2019-260600,2019-05-25,000001,Vente,65000,,,VILLAGE EST,B030,21530,21531,Rouvray,21,,,21531000AC0127,,,,,,,,,,,,,0,,,,,J,jardins,,,1760,4.106534,47.425093
2019-260600,2019-05-25,000001,Vente,65000,,,VILLAGE EST,B030,21530,21531,Rouvray,21,,,21531000AC0143,,,,,,,,,,,,,0,,,,,VE,vergers,,,939,4.106563,47.425591
2019-260604,2019-05-25,000001,Vente,62000,,,VILLAGE EST,B030,21530,21531,Rouvray,21,,,21531000AC0285,,,,,,,,,,,,,0,,,,,T,terres,,,3912,4.104903,47.421547
2019-260604,2019-05-25,000001,Vente,62000,7,,RUE DE SAINT ANDEUX,0650,21530,21531,Rouvray,21,,,21531000AC0303,,,,,,,,,,,,,0,1,Maison,63,4,S,sols,,,798,4.104514,47.421492
2019-260604,2019-05-25,000001,Vente,62000,,,VILLAGE EST,B030,21530,21531,Rouvray,21,,,21531000AC0304,,,,,,,,,,,,,0,,,,,J,jardins,,,532,4.104446,47.421409
2019-260604,2019-05-25,000001,Vente,62000,,,VILLAGE EST,B030,21530,21531,Rouvray,21,,,21531000AC0305,,,,,,,,,,,,,0,,,,,VE,vergers,,,508,4.104579,47.421242
2019-260622,2019-05-11,000001,Vente,86000,,,LERIGNY,B018,21530,21531,Rouvray,21,,,215310000B0137,,,,,,,,,,,,,0,,,,,P,prés,,,14645,4.107435,47.402566
2019-260690,2019-06-20,000001,Vente,3000,,,LES COURIERES,B009,21530,21531,Rouvray,21,,,21531000ZA0016,,,,,,,,,,,,,0,,,,,P,prés,,,24661,4.138856,47.411337
2019-260690,2019-06-20,000001,Vente,3000,,,LES COURIERES,B009,21530,21531,Rouvray,21,,,21531000ZA0019,,,,,,,,,,,,,0,,,,,T,terres,,,4634,4.140433,47.412237
2019-260789,2019-07-13,000001,Vente,215611,5,,RUE MOISSON,0520,21530,21531,Rouvray,21,,,21531000AC0055,,,,,,,,,,,,,0,1,Maison,180,8,S,sols,,,490,4.10312,47.423579
2019-260789,2019-07-13,000001,Vente,215611,,,VILLAGE EST,B030,21530,21531,Rouvray,21,,,21531000AC0057,,,,,,,,,,,,,0,,,,,J,jardins,,,460,4.103304,47.423736
2019-260887,2019-08-30,000001,Vente,500400,,,VILLAGE OUEST,B031,21530,21531,Rouvray,21,,,21531000AB0042,,,,,,,,,,,,,0,,,,,VE,vergers,,,3149,4.103745,47.425869
2019-260887,2019-08-30,000001,Vente,500400,,,VILLAGE OUEST,B031,21530,21531,Rouvray,21,,,21531000AB0043,,,,,,,,,,,,,0,,,,,J,jardins,,,914,4.103448,47.42559
2019-260887,2019-08-30,000001,Vente,500400,,,VILLAGE OUEST,B031,21530,21531,Rouvray,21,,,21531000AB0048,,,,,,,,,,,,,0,,,,,VE,vergers,,,460,4.103024,47.425814
2019-260887,2019-08-30,000001,Vente,500400,,,VILLAGE OUEST,B031,21530,21531,Rouvray,21,,,21531000AB0049,,,,,,,,,,,,,0,,,,,AG,terrains d'agrément,,,5435,4.102569,47.426024
2019-260887,2019-08-30,000001,Vente,500400,3,A,RUE DES JARDINS,0420,21530,21531,Rouvray,21,,,21531000AB0050,,,,,,,,,,,,,0,3,Dépendance,,0,S,sols,,,9,4.102865,47.426505
2019-260887,2019-08-30,000001,Vente,500400,,,VILLAGE OUEST,B031,21530,21531,Rouvray,21,,,21531000AB0051,,,,,,,,,,,,,0,,,,,J,jardins,,,404,4.102856,47.426526
2019-260887,2019-08-30,000001,Vente,500400,3,A,RUE DES JARDINS,0420,21530,21531,Rouvray,21,,,21531000AB0059,,,,,,,,,,,,,0,3,Dépendance,,0,S,sols,,,8,4.102139,47.425711
2019-260887,2019-08-30,000001,Vente,500400,3,A,RUE DES JARDINS,0420,21530,21531,Rouvray,21,,,21531000AB0060,,,,,,,,,,,,,0,1,Maison,170,8,S,sols,,,755,4.102425,47.42559
2019-260887,2019-08-30,000001,Vente,500400,,,VILLAGE OUEST,B031,21530,21531,Rouvray,21,,,21531000AB0262,,,,,,,,,,,,,0,,,,,P,prés,,,17235,4.10366,47.426753
