id_mutation,date_mutation,numero_disposition,nature_mutation,valeur_fonciere,adresse_numero,adresse_suffixe,adresse_nom_voie,adresse_code_voie,code_postal,code_commune,nom_commune,code_departement,ancien_code_commune,ancien_nom_commune,id_parcelle,ancien_id_parcelle,numero_volume,lot1_numero,lot1_surface_carrez,lot2_numero,lot2_surface_carrez,lot3_numero,lot3_surface_carrez,lot4_numero,lot4_surface_carrez,lot5_numero,lot5_surface_carrez,nombre_lots,code_type_local,type_local,surface_reelle_bati,nombre_pieces_principales,code_nature_culture,nature_culture,code_nature_culture_speciale,nature_culture_speciale,surface_terrain,longitude,latitude
2019-274066,2019-01-07,000001,Vente,156990,4,,LOT KOUPAIA,A035,22450,22101,Langoat,22,,,22101000ZH0259,,,,,,,,,,,,,0,1,Maison,80,5,J,jardins,,,499,-3.286116,48.751808
2019-274066,2019-01-07,000001,Vente,156990,4,,LOT KOUPAIA,A035,22450,22101,Langoat,22,,,22101000ZH0259,,,,,,,,,,,,,0,1,Maison,80,5,S,sols,,,500,-3.286116,48.751808
2019-274092,2019-01-14,000001,Vente,31160,3,,RUE CLOS DE KERLIDER,0011,22450,22101,Langoat,22,,,221010000A1237,,,,,,,,,,,,,0,,,,,AB,terrains a bâtir,,,779,-3.280522,48.746094
2019-274093,2019-01-16,000001,Vente,36160,6,,RUE CLOS DE KERLIDER,0011,22450,22101,Langoat,22,,,221010000A1241,,,,,,,,,,,,,0,,,,,AB,terrains a bâtir,,,904,-3.281109,48.746357
2019-274113,2019-01-15,000001,Vente,50000,16,,CRECH GAILLARD,B130,22450,22101,Langoat,22,,,22101000ZI0051,,,,,,,,,,,,,0,1,Maison,63,3,S,sols,,,195,-3.265738,48.741656
2019-274113,2019-01-15,000001,Vente,50000,,,SAINT YVES,B422,22450,22101,Langoat,22,,,22101000ZI0076,,,,,,,,,,,,,0,,,,,T,terres,,,1037,-3.266077,48.741824
2019-274113,2019-01-15,000001,Vente,50000,,,SAINT YVES,B422,22450,22101,Langoat,22,,,22101000ZI0079,,,,,,,,,,,,,0,,,,,T,terres,,,326,-3.26619,48.741516
2019-274144,2019-01-30,000001,Vente,290000,8,B,RUE DE BELLEVUE,0008,22450,22101,Langoat,22,,,22101000ZH0246,,,,,,,,,,,,,0,1,Maison,230,8,J,jardins,,,2000,-3.282605,48.748085
2019-274144,2019-01-30,000001,Vente,290000,8,B,RUE DE BELLEVUE,0008,22450,22101,Langoat,22,,,22101000ZH0246,,,,,,,,,,,,,0,1,Maison,230,8,S,sols,,,500,-3.282605,48.748085
2019-274153,2019-01-24,000001,Vente,26120,5,,RUE CLOS DE KERLIDER,0011,22450,22101,Langoat,22,,,221010000A1236,,,,,,,,,,,,,0,,,,,AB,terrains a bâtir,,,653,-3.28065,48.745837
2019-274159,2019-01-30,000001,Vente,50000,5437,,COAT CROAS,B055,22450,22101,Langoat,22,,,221010000A0981,,,,,,,,,,,,,0,1,Maison,64,3,S,sols,,,574,-3.285944,48.749884
2019-274304,2019-02-18,000001,Vente,18000,5043,,CRECH GAILLARD,B130,22450,22101,Langoat,22,,,221010000A0117,,,,,,,,,,,,,0,1,Maison,55,2,S,sols,,,130,-3.265078,48.74202
2019-274375,2019-02-15,000001,Vente,106500,5080,,LE BOURG,B033,22450,22101,Langoat,22,,,221010000A0889,,,,,,,,,,,,,0,1,Maison,68,4,S,sols,,,422,-3.282286,48.749752
2019-274375,2019-02-15,000001,Vente,106500,,,ROCHE JAN GILLET,B416,22450,22101,Langoat,22,,,221010000A1158,,,,,,,,,,,,,0,,,,,T,terres,,,212,-3.282302,48.74959
2019-274396,2019-02-26,000001,Vente,130000,,,LE CRAN,B119,22450,22101,Langoat,22,,,22101000ZL0014,,,,,,,,,,,,,0,,,,,T,terres,,,7015,,
2019-274396,2019-02-26,000001,Vente,130000,,,LE CRAN,B119,22450,22101,Langoat,22,,,22101000ZL0014,,,,,,,,,,,,,0,,,,,T,terres,,,21045,,
2019-274396,2019-02-26,000001,Vente,130000,,,LE CRAN,B119,22450,22101,Langoat,22,,,22101000ZL0015,,,,,,,,,,,,,0,,,,,T,terres,,,51300,-3.303739,48.73756
2019-274396,2019-02-26,000001,Vente,130000,,,LE CRAN,B119,22450,22101,Langoat,22,,,22101000ZL0015,,,,,,,,,,,,,0,,,,,T,terres,,,34200,-3.303739,48.73756
2019-274446,2019-03-07,000001,Vente,75000,13,,L'ETOILE,B143,22450,22101,Langoat,22,,,22101000ZV0058,,,,,,,,,,,,,0,1,Maison,68,3,S,sols,,,531,-3.31792,48.714406
2019-274446,2019-03-07,000001,Vente,75000,,,AR COURTIL,B016,22450,22101,Langoat,22,,,22101000ZV0082,,,,,,,,,,,,,0,,,,,T,terres,,,705,-3.318249,48.714483
2019-274446,2019-03-07,000001,Vente,75000,,,CONVENANT BOURHIS,B077,22450,22101,Langoat,22,,,22101000ZV0083,,,,,,,,,,,,,0,,,,,T,terres,,,280,-3.317848,48.714293
2019-274449,2019-03-11,000001,Vente,15000,,,TY GLAS,B434,22450,22101,Langoat,22,,,22101000ZM0121,,,,,,,,,,,,,0,,,,,T,terres,,,944,-3.283941,48.731929
2019-274449,2019-03-11,000001,Vente,15000,,,TY GLAS,B434,22450,22101,Langoat,22,,,22101000ZM0123,,,,,,,,,,,,,0,,,,,T,terres,,,3843,-3.284341,48.732423
2019-274545,2019-03-13,000001,Vente,320000,,,PARC FRANCOIS CAPITAINE,B331,22450,22101,Langoat,22,,,221010000A0291,,,,,,,,,,,,,0,,,,,T,terres,,,770,-3.278391,48.752142
2019-274545,2019-03-13,000001,Vente,320000,,,PARC FRANCOIS CAPITAINE,B331,22450,22101,Langoat,22,,,221010000A0292,,,,,,,,,,,,,0,,,,,T,terres,,,1440,-3.278564,48.752387
2019-274545,2019-03-13,000001,Vente,320000,,,AR JARDIN,B017,22450,22101,Langoat,22,,,221010000A0294,,,,,,,,,,,,,0,,,,,J,jardins,,,2710,-3.27895,48.751904
2019-274545,2019-03-13,000001,Vente,320000,,,PARC FRANCOIS CAPITAINE,B331,22450,22101,Langoat,22,,,221010000A1155,,,,,,,,,,,,,0,,,,,T,terres,,,2844,-3.279469,48.751758
2019-274545,2019-03-13,000001,Vente,320000,1,,RUE DES ETANGS,0033,22450,22101,Langoat,22,,,221010000A1171,,,,,,,,,,,,,0,1,Maison,125,3,S,sols,,,1255,-3.279071,48.752027
2019-274545,2019-03-13,000001,Vente,320000,1,,RUE DES ETANGS,0033,22450,22101,Langoat,22,,,221010000A1171,,,,,,,,,,,,,0,3,Dépendance,,0,S,sols,,,1255,-3.279071,48.752027
2019-274545,2019-03-13,000001,Vente,320000,1,,RUE DES ETANGS,0033,22450,22101,Langoat,22,,,221010000A1171,,,,,,,,,,,,,0,1,Maison,155,5,S,sols,,,1255,-3.279071,48.752027
2019-274545,2019-03-13,000001,Vente,320000,,,RUE DES ETANGS,0033,22450,22101,Langoat,22,,,221010000A1172,,,,,,,,,,,,,0,,,,,S,sols,,,5,-3.279261,48.751873
2019-274684,2019-03-29,000001,Vente,295050,5501,,LE CRAN,B119,22450,22101,Langoat,22,,,22101000ZL0041,,,,,,,,,,,,,0,1,Maison,196,7,S,sols,,,820,-3.305198,48.733873
2019-274684,2019-03-29,000001,Vente,295050,5501,,LE CRAN,B119,22450,22101,Langoat,22,,,22101000ZL0041,,,,,,,,,,,,,0,1,Maison,196,7,J,jardins,,,2805,-3.305198,48.733873
2019-274684,2019-03-29,000001,Vente,295050,,,STE AURELIE,B420,22450,22101,Langoat,22,,,22101000ZL0078,,,,,,,,,,,,,0,,,,,J,jardins,,,260,-3.304992,48.733889
2019-274768,2019-04-18,000001,Vente,21240,16,,RUE CLOS DE KERLIDER,0011,22450,22101,Langoat,22,,,221010000A1235,,,,,,,,,,,,,0,,,,,AB,terrains a bâtir,,,531,-3.280538,48.745593
2019-274892,2019-05-03,000001,Vente,143000,,,TY GLAS,B434,22450,22101,Langoat,22,,,22101000ZM0070,,,,,,,,,,,,,0,,,,,J,jardins,,,440,-3.283362,48.73169
2019-274892,2019-05-03,000001,Vente,143000,9001,,CONVENANT TANO,B107,22450,22101,Langoat,22,,,22101000ZM0115,,,,,,,,,,,,,0,1,Maison,95,4,S,sols,,,500,-3.283504,48.73137
2019-274892,2019-05-03,000001,Vente,143000,9001,,CONVENANT TANO,B107,22450,22101,Langoat,22,,,22101000ZM0115,,,,,,,,,,,,,0,1,Maison,95,4,J,jardins,,,1877,-3.283504,48.73137
2019-274975,2019-05-15,000001,Vente,21320,14,,RUE CLOS DE KERLIDER,0011,22450,22101,Langoat,22,,,221010000A1234,,,,,,,,,,,,,0,,,,,AB,terrains a bâtir,,,533,-3.280839,48.745581
2019-274992,2019-05-14,000001,Vente,14088,,,RES BELLEVUE,A006,22450,22101,Langoat,22,,,22101000ZH0318,,,,,,,,,,,,,0,,,,,AB,terrains a bâtir,,,373,-3.283586,48.750377
2019-274992,2019-05-14,000001,Vente,14088,,,RES BELLEVUE,A006,22450,22101,Langoat,22,,,22101000ZH0319,,,,,,,,,,,,,0,,,,,AB,terrains a bâtir,,,214,-3.283645,48.750222
2019-275057,2019-05-20,000001,Vente,4855.8,,,KER OMEN,B186,22450,22101,Langoat,22,,,22101000ZV0104,,,,,,,,,,,,,0,,,,,T,terres,,,8093,-3.321952,48.713733
2019-275081,2019-05-29,000001,Vente,161500,5,,RUE DE COAT CROAS,0013,22450,22101,Langoat,22,,,22101000ZH0301,,,,,,,,,,,,,0,1,Maison,110,4,S,sols,,,700,-3.287155,48.748489
2019-275081,2019-05-29,000001,Vente,161500,5,,RUE DE COAT CROAS,0013,22450,22101,Langoat,22,,,22101000ZH0301,,,,,,,,,,,,,0,1,Maison,110,4,J,jardins,,,796,-3.287155,48.748489
2019-275097,2019-05-14,000001,Vente,122000,1,,LOT CLATIN,A017,22450,22101,Langoat,22,,,22101000ZH0055,,,,,,,,,,,,,0,1,Maison,105,5,S,sols,,,951,-3.285376,48.75278
2019-275278,2019-06-21,000001,Vente,26700,7,,RUE DES ECOLES,0020,22450,22101,Langoat,22,,,221010000A0247,,,,,,,,,,,,,0,1,Maison,130,1,S,sols,,,315,-3.281574,48.750009
2019-275330,2019-06-25,000001,Vente,123000,5060,,CONVENANT FOURMAL,B088,22450,22101,Langoat,22,,,22101000ZI0101,,,,,,,,,,,,,0,1,Maison,130,3,S,sols,,,2260,-3.279964,48.746204
2019-275330,2019-06-25,000001,Vente,123000,5060,,CONVENANT FOURMAL,B088,22450,22101,Langoat,22,,,22101000ZI0101,,,,,,,,,,,,,0,1,Maison,130,3,T,terres,,,7121,-3.279964,48.746204
2019-275364,2019-06-27,000001,Vente,165000,5209,,KERUALO,B206,22450,22101,Langoat,22,,,22101000ZR0097,,,,,,,,,,,,,0,1,Maison,122,6,S,sols,,,844,-3.302372,48.718012
2019-275364,2019-06-27,000001,Vente,165000,5209,,KERUALO,B206,22450,22101,Langoat,22,,,22101000ZR0097,,,,,,,,,,,,,0,1,Maison,122,6,J,jardins,,,1400,-3.302372,48.718012
2019-275382,2019-06-27,000002,Vente,1000,,,LEZEVEN,B230,22450,22101,Langoat,22,,,22101000ZP0132,,,,,,,,,,,,,0,,,,,T,terres,,,828,-3.283179,48.730456
2019-275620,2019-07-16,000001,Vente,80000,5384,,LE BOURG,B033,22450,22101,Langoat,22,,,221010000A0863,,,,,,,,,,,,,0,1,Maison,50,3,S,sols,,,302,-3.283226,48.75206
2019-275620,2019-07-16,000001,Vente,80000,,,CLOS BRAS,B045,22450,22101,Langoat,22,,,221010000A1135,,,,,,,,,,,,,0,,,,,S,sols,,,410,-3.283177,48.752169
2019-275621,2019-07-15,000001,Vente,185000,5317,,KER SALLIOU,B187,22450,22101,Langoat,22,,,22101000ZL0044,,,,,,,,,,,,,0,1,Maison,71,2,T,terres,,,3825,-3.310518,48.735719
2019-275621,2019-07-15,000001,Vente,185000,5317,,KER SALLIOU,B187,22450,22101,Langoat,22,,,22101000ZL0044,,,,,,,,,,,,,0,1,Maison,71,2,S,sols,,,500,-3.310518,48.735719
2019-275622,2019-07-15,000001,Vente,35080,10,,RUE CLOS DE KERLIDER,0011,22450,22101,Langoat,22,,,221010000A1239,,,,,,,,,,,,,0,,,,,AB,terrains a bâtir,,,877,-3.281278,48.745862
2019-275693,2019-08-12,000001,Vente,95000,,,KERFUBU,B195,22450,22101,Langoat,22,,,22101000ZE0054,,,,,,,,,,,,,0,,,,,T,terres,,,900,-3.299692,48.748998
2019-275693,2019-08-12,000001,Vente,95000,5368,,COZCARADEC,B115,22450,22101,Langoat,22,,,22101000ZE0081,,,,,,,,,,,,,0,1,Maison,104,4,S,sols,,,370,-3.299684,48.74885
2019-275696,2019-08-07,000001,Vente,85000,2,,KERPUNS,B478,22450,22101,Langoat,22,,,22101000ZD0061,,,,,,,,,,,,,0,1,Maison,119,4,S,sols,,,215,-3.294404,48.745098
2019-275696,2019-08-07,000001,Vente,85000,,,COAT AN PUNS,B049,22450,22101,Langoat,22,,,22101000ZD0104,,,,,,,,,,,,,0,,,,,S,sols,,,263,-3.294533,48.745113
2019-275696,2019-08-07,000001,Vente,85000,,,COAT AN PUNS,B049,22450,22101,Langoat,22,,,22101000ZD0106,,,,,,,,,,,,,0,,,,,T,terres,,,5639,-3.294412,48.74548
2019-275767,2019-08-16,000001,Vente,160000,5227,,CAMBLEC,B036,22450,22101,Langoat,22,,,22101000ZS0051,,,,,,,,,,,,,0,1,Maison,142,5,S,sols,,,1661,-3.311196,48.725314
2019-275767,2019-08-16,000001,Vente,160000,5227,,CAMBLEC,B036,22450,22101,Langoat,22,,,22101000ZS0051,,,,,,,,,,,,,0,1,Maison,142,5,T,terres,,,1069,-3.311196,48.725314
2019-275767,2019-08-16,000001,Vente,160000,5227,,CAMBLEC,B036,22450,22101,Langoat,22,,,22101000ZS0051,,,,,,,,,,,,,0,1,Maison,142,5,T,terres,,,4270,-3.311196,48.725314
2019-275767,2019-08-16,000001,Vente,160000,,,PARC AR VILIN,B316,22450,22101,Langoat,22,,,22101000ZS0111,,,,,,,,,,,,,0,,,,,S,sols,,,228,-3.311539,48.725017
2019-275797,2019-08-20,000001,Vente,29800,1,,RUE CLOS DE KERLIDER,0011,22450,22101,Langoat,22,,,221010000A1238,,,,,,,,,,,,,0,,,,,AB,terrains a bâtir,,,745,-3.280561,48.746311
2019-275806,2019-08-23,000001,Vente,130000,7,,RES BELLEVUE,A006,22450,22101,Langoat,22,,,22101000ZH0236,,,,,,,,,,,,,0,1,Maison,97,5,J,jardins,,,333,-3.284272,48.749945
2019-275806,2019-08-23,000001,Vente,130000,7,,RES BELLEVUE,A006,22450,22101,Langoat,22,,,22101000ZH0236,,,,,,,,,,,,,0,1,Maison,97,5,S,sols,,,600,-3.284272,48.749945
2019-276019,2019-08-27,000001,Vente,155000,24,,LOT CLATIN,A017,22450,22101,Langoat,22,,,22101000ZH0051,,,,,,,,,,,,,0,1,Maison,113,5,S,sols,,,699,-3.285686,48.7525
2019-276098,2019-09-23,000001,Vente,15000,123,,GOAS AN GAC,B147,22450,22101,Langoat,22,,,22101000ZN0123,,,,,,,,,,,,,0,4,Local industriel. commercial ou assimilé,150,0,S,sols,,,444,-3.280283,48.732385
2019-276098,2019-09-23,000001,Vente,15000,,,BOIS DE LA HAIE,B029,22450,22101,Langoat,22,,,22101000ZN0124,,,,,,,,,,,,,0,,,,,S,sols,,,39,-3.280328,48.732209
2019-276098,2019-09-23,000001,Vente,15000,,,AR LIORS,B019,22450,22101,Langoat,22,,,22101000ZN0128,,,,,,,,,,,,,0,,,,,J,jardins,,,191,-3.280156,48.73236
2019-276283,2019-10-16,000001,Vente,115500,7,,GOAS AN GAC,B147,22450,22101,Langoat,22,,,22101000ZN0086,,,,,,,,,,,,,0,1,Maison,88,5,J,jardins,,,1474,-3.280563,48.733151
2019-276283,2019-10-16,000001,Vente,115500,7,,GOAS AN GAC,B147,22450,22101,Langoat,22,,,22101000ZN0086,,,,,,,,,,,,,0,1,Maison,88,5,S,sols,,,526,-3.280563,48.733151
2019-276637,2019-11-15,000001,Vente,30000,5340,,TREVENOU,B430,22450,22101,Langoat,22,,,22101000ZA0090,,,,,,,,,,,,,0,1,Maison,103,5,S,sols,,,500,-3.333521,48.743242
2019-276637,2019-11-15,000001,Vente,30000,5340,,TREVENOU,B430,22450,22101,Langoat,22,,,22101000ZA0090,,,,,,,,,,,,,0,1,Maison,103,5,AG,terrains d'agrément,,,2441,-3.333521,48.743242
2019-276637,2019-11-15,000001,Vente,30000,,,TREVENOU,B430,22450,22101,Langoat,22,,,22101000ZA0114,,,,,,,,,,,,,0,,,,,T,terres,,,100,-3.33339,48.742885
2019-276709,2019-12-11,000001,Vente,123000,2,B,RUE DE BELLEVUE,0008,22450,22101,Langoat,22,,,221010000A1157,,,,,,,,,,,,,0,1,Maison,108,4,AG,terrains d'agrément,,,342,-3.282308,48.749275
2019-276709,2019-12-11,000001,Vente,123000,2,B,RUE DE BELLEVUE,0008,22450,22101,Langoat,22,,,221010000A1157,,,,,,,,,,,,,0,1,Maison,108,4,S,sols,,,600,-3.282308,48.749275
2019-276754,2019-12-16,000001,Vente,180000,,,COAT GUEZENNEC,B059,22450,22101,Langoat,22,,,22101000ZH0308,,,,,,,,,,,,,0,,,,,T,terres,,,135,-3.291794,48.746774
2019-276754,2019-12-16,000001,Vente,180000,,,STATAFFENO,B423,22450,22101,Langoat,22,,,22101000ZH0311,,,,,,,,,,,,,0,,,,,T,terres,,,157,-3.291727,48.746877
2019-276754,2019-12-16,000001,Vente,180000,,,STATAFFENO,B423,22450,22101,Langoat,22,,,22101000ZH0312,,,,,,,,,,,,,0,,,,,T,terres,,,18,-3.291168,48.746902
2019-276754,2019-12-16,000001,Vente,180000,5262,,FONTAINE PABU,B145,22450,22101,Langoat,22,,,22101000ZH0314,,,,,,,,,,,,,0,1,Maison,120,3,S,sols,,,820,-3.291401,48.747035
2019-276754,2019-12-16,000001,Vente,180000,,,AR JARDIN,B017,22450,22101,Langoat,22,,,22101000ZH0316,,,,,,,,,,,,,0,,,,,S,sols,,,12,-3.291532,48.746772
2019-276754,2019-12-16,000001,Vente,180000,,,AR JARDIN,B017,22450,22101,Langoat,22,,,22101000ZH0316,,,,,,,,,,,,,0,,,,,T,terres,,,875,-3.291532,48.746772
2019-276842,2019-12-21,000001,Vente,131500,5225,,CAMBLEC,B036,22450,22101,Langoat,22,,,22101000ZS0118,,,,,,,,,,,,,0,1,Maison,99,3,S,sols,,,2830,-3.309114,48.723646
2019-276842,2019-12-21,000001,Vente,131500,5225,,CAMBLEC,B036,22450,22101,Langoat,22,,,22101000ZS0118,,,,,,,,,,,,,0,1,Maison,99,3,P,prés,,,3948,-3.309114,48.723646
2019-276842,2019-12-21,000001,Vente,131500,5225,,CAMBLEC,B036,22450,22101,Langoat,22,,,22101000ZS0118,,,,,,,,,,,,,0,1,Maison,99,3,T,terres,,,3158,-3.309114,48.723646
2019-276982,2019-12-23,000001,Vente,71750,30,,LOT KOUPAIA,A035,22450,22101,Langoat,22,,,22101000ZH0292,,,,,,,,,,,,,0,1,Maison,107,5,S,sols,,,885,-3.284589,48.751075
2019-276984,2019-12-24,000001,Vente,80000,5095,,KER UZADOU,B188,22450,22101,Langoat,22,,,22101000ZK0077,,,,,,,,,,,,,0,1,Maison,53,2,S,sols,,,1132,-3.282114,48.739772
2019-276987,2019-12-23,000001,Vente,23000,9,,RUE DE BELLEVUE,0008,22450,22101,Langoat,22,,,221010000A0239,,,,,,,,,,,,,0,1,Maison,63,3,S,sols,,,70,-3.281951,48.749532
2019-277028,2019-12-20,000001,Vente,39000,,,AN LANNEC,B007,22450,22101,Langoat,22,,,221010000B0439,,,,,,,,,,,,,0,,,,,BR,futaies résineuses,,,3070,-3.279458,48.720612
2019-277028,2019-12-20,000001,Vente,39000,,,ROD ADAM,B418,22450,22101,Langoat,22,,,221010000B0450,,,,,,,,,,,,,0,,,,,BR,futaies résineuses,,,3760,-3.279991,48.717954
2019-277028,2019-12-20,000001,Vente,39000,,,AN LANNEC,B007,22450,22101,Langoat,22,,,221010000B0462,,,,,,,,,,,,,0,,,,,BF,futaies feuillues,,,6210,-3.280729,48.720385
2019-277028,2019-12-20,000001,Vente,39000,,,KERLAST,B199,22450,22101,Langoat,22,,,22101000ZP0051,,,,,,,,,,,,,0,,,,,BF,futaies feuillues,,,4110,-3.281513,48.718134
2019-277028,2019-12-20,000001,Vente,39000,,,KERLAST,B199,22450,22101,Langoat,22,,,22101000ZP0131,,,,,,,,,,,,,0,,,,,BF,futaies feuillues,,,48213,-3.278723,48.719496
