id_mutation,date_mutation,numero_disposition,nature_mutation,valeur_fonciere,adresse_numero,adresse_suffixe,adresse_nom_voie,adresse_code_voie,code_postal,code_commune,nom_commune,code_departement,ancien_code_commune,ancien_nom_commune,id_parcelle,ancien_id_parcelle,numero_volume,lot1_numero,lot1_surface_carrez,lot2_numero,lot2_surface_carrez,lot3_numero,lot3_surface_carrez,lot4_numero,lot4_surface_carrez,lot5_numero,lot5_surface_carrez,nombre_lots,code_type_local,type_local,surface_reelle_bati,nombre_pieces_principales,code_nature_culture,nature_culture,code_nature_culture_speciale,nature_culture_speciale,surface_terrain,longitude,latitude
2019-271748,2019-01-22,000001,Vente,124000,4,,KERNEFFRET,C366,22160,22132,Lohuec,22,,,221320000A0519,,,,,,,,,,,,,0,1,Maison,52,2,S,sols,,,840,-3.537998,48.460034
2019-271748,2019-01-22,000001,Vente,124000,2,,KERNEFFRET,C366,22160,22132,Lohuec,22,,,221320000A0520,,,,,,,,,,,,,0,1,Maison,96,5,T,terres,,,5263,-3.537778,48.459671
2019-271748,2019-01-22,000001,Vente,124000,2,,KERNEFFRET,C366,22160,22132,Lohuec,22,,,221320000A0520,,,,,,,,,,,,,0,1,Maison,96,5,S,sols,,,1437,-3.537778,48.459671
2019-271748,2019-01-22,000001,Vente,124000,,,KERNEFFRET,C366,22160,22132,Lohuec,22,,,221320000A0521,,,,,,,,,,,,,0,,,,,T,terres,,,1570,-3.538235,48.459469
2019-271748,2019-01-22,000001,Vente,124000,,,KERNEFFRET,C366,22160,22132,Lohuec,22,,,221320000A0530,,,,,,,,,,,,,0,,,,,S,sols,,,52,-3.538392,48.459842
2019-271748,2019-01-22,000001,Vente,124000,,,KERNEFFRET,C366,22160,22132,Lohuec,22,,,221320000A0530,,,,,,,,,,,,,0,,,,,T,terres,,,267,-3.538392,48.459842
2019-271748,2019-01-22,000001,Vente,124000,,,KERNEFFRET,C366,22160,22132,Lohuec,22,,,221320000A0532,,,,,,,,,,,,,0,,,,,S,sols,,,59,-3.538521,48.459989
2019-271748,2019-01-22,000001,Vente,124000,,,MINE BIHEN,B481,22160,22132,Lohuec,22,,,221320000A0543,,,,,,,,,,,,,0,,,,,T,terres,,,9050,-3.538351,48.461651
2019-272037,2019-02-27,000001,Vente,73000,14,,RUE DE LA FORGE,0029,22160,22132,Lohuec,22,,,22132000AB0022,,,,,,,,,,,,,0,1,Maison,86,2,S,sols,,,450,-3.522423,48.459487
2019-272037,2019-02-27,000001,Vente,73000,,,AU BOURG,B037,22160,22132,Lohuec,22,,,22132000AB0092,,,,,,,,,,,,,0,,,,,S,sols,,,349,-3.522429,48.458924
2019-272075,2019-02-22,000002,Vente,60200,,,PARC LOCIA,B872,22160,22132,Lohuec,22,,,221320000D0546,,,,,,,,,,,,,0,,,,,T,terres,,,1407,-3.544595,48.458205
2019-272075,2019-02-22,000002,Vente,60200,,,PARC LOCIA,B872,22160,22132,Lohuec,22,,,221320000D0546,,,,,,,,,,,,,0,,,,,S,sols,,,2203,-3.544595,48.458205
2019-272075,2019-02-22,000002,Vente,60200,,,AR ROHELOU,B030,22160,22132,Lohuec,22,,,221320000D0547,,,,,,,,,,,,,0,,,,,T,terres,,,3608,-3.544215,48.458634
2019-272075,2019-02-22,000002,Vente,60200,,,AR ROHELOU,B030,22160,22132,Lohuec,22,,,221320000D0547,,,,,,,,,,,,,0,,,,,S,sols,,,1512,-3.544215,48.458634
2019-272075,2019-02-22,000002,Vente,60200,,,PARC PLASQUER,B955,22160,22132,Lohuec,22,,,221320000D0548,,,,,,,,,,,,,0,,,,,T,terres,,,6180,-3.543418,48.458339
2019-272462,2019-04-30,000001,Vente,39000,,,KERNEFFRET,C366,22160,22132,Lohuec,22,,,221320000A0510,,,,,,,,,,,,,0,,,,,T,terres,,,350,-3.53722,48.460427
2019-272462,2019-04-30,000001,Vente,39000,,,KERNEFFRET,C366,22160,22132,Lohuec,22,,,221320000A0511,,,,,,,,,,,,,0,,,,,S,sols,,,166,-3.537482,48.460439
2019-272462,2019-04-30,000001,Vente,39000,1,,KERNEFFRET,C366,22160,22132,Lohuec,22,,,221320000A0512,,,,,,,,,,,,,0,1,Maison,41,1,S,sols,,,562,-3.537441,48.46056
2019-272462,2019-04-30,000001,Vente,39000,,,KERNEFFRET,C366,22160,22132,Lohuec,22,,,221320000A0513,,,,,,,,,,,,,0,,,,,T,terres,,,380,-3.537128,48.46063
2019-272462,2019-04-30,000001,Vente,39000,,,KERNEFFRET,C366,22160,22132,Lohuec,22,,,221320000A0515,,,,,,,,,,,,,0,,,,,S,sols,,,273,-3.537075,48.460809
2019-272511,2019-05-06,000001,Vente,45000,2,,RUE DE L ECOLE,0019,22160,22132,Lohuec,22,,,22132000AB0048,,,,,,,,,,,,,0,1,Maison,104,4,S,sols,,,231,-3.521379,48.460124
2019-273312,2019-09-05,000001,Vente,400,,,KERNEFFRET,C366,22160,22132,Lohuec,22,,,221320000A0514,,,,,,,,,,,,,0,,,,,S,sols,,,84,-3.537265,48.460651
2019-273312,2019-09-05,000001,Vente,400,,,KERNEFFRET,C366,22160,22132,Lohuec,22,,,221320000A0516,,,,,,,,,,,,,0,,,,,T,terres,,,685,-3.537371,48.46076
2019-273581,2019-10-22,000001,Vente,22000,,,KERNEFFRET,C366,22160,22132,Lohuec,22,,,221320000A0529,,,,,,,,,,,,,0,,,,,T,terres,,,302,-3.538541,48.459736
2019-273581,2019-10-22,000001,Vente,22000,3,,KERNEFFRET,C366,22160,22132,Lohuec,22,,,221320000A0534,,,,,,,,,,,,,0,1,Maison,31,1,S,sols,,,44,-3.538425,48.460156
2019-273754,2019-11-14,000001,Vente,24500,,,COAT AR STANG,B070,22160,22132,Lohuec,22,,,221320000A0617,,,,,,,,,,,,,0,,,,,S,sols,,,74,-3.53052,48.457
2019-273754,2019-11-14,000001,Vente,24500,,,COAT AR STANG,B070,22160,22132,Lohuec,22,,,221320000A0859,,,,,,,,,,,,,0,,,,,L,landes,,,594,-3.530565,48.457126
2019-273754,2019-11-14,000001,Vente,24500,,,PARC GROAS BIHAN,B778,22160,22132,Lohuec,22,,,221320000A0879,,,,,,,,,,,,,0,,,,,T,terres,,,433,-3.530432,48.457173
2019-273874,2019-12-06,000001,Vente,2500,,,GOAREM AR PARC BRAS,B126,22160,22132,Lohuec,22,,,221320000B0844,,,,,,,,,,,,,0,,,,,T,terres,,,4492,-3.512321,48.465423
