id_mutation,date_mutation,numero_disposition,nature_mutation,valeur_fonciere,adresse_numero,adresse_suffixe,adresse_nom_voie,adresse_code_voie,code_postal,code_commune,nom_commune,code_departement,ancien_code_commune,ancien_nom_commune,id_parcelle,ancien_id_parcelle,numero_volume,lot1_numero,lot1_surface_carrez,lot2_numero,lot2_surface_carrez,lot3_numero,lot3_surface_carrez,lot4_numero,lot4_surface_carrez,lot5_numero,lot5_surface_carrez,nombre_lots,code_type_local,type_local,surface_reelle_bati,nombre_pieces_principales,code_nature_culture,nature_culture,code_nature_culture_speciale,nature_culture_speciale,surface_terrain,longitude,latitude
2019-274104,2019-01-10,000001,Vente,102000,49,,RUE D'ARMOR,0005,22710,22166,Penvénan,22,,,22166000AD0007,,,,,,,,,,,,,0,1,Maison,79,5,S,sols,,,534,-3.298302,48.81696
2019-274104,2019-01-10,000001,Vente,102000,,,BAR NEOL,B084,22710,22166,Penvénan,22,,,22166000AD0008,,,,,,,,,,,,,0,,,,,J,jardins,,,690,-3.298479,48.81694
2019-274117,2019-01-21,000001,Vente,74375,8,,RUE DES PATRIOTES,0042,22710,22166,Penvénan,22,,,22166000AE0117,,,,,,,,,,,,,0,1,Maison,86,5,S,sols,,,586,-3.296137,48.809131
2019-274155,2019-01-25,000001,Vente,22000,,,AR JARDIN,B044,22710,22166,Penvénan,22,,,221660000B0560,,,,,,,,,,,,,0,,,,,AB,terrains a bâtir,,,400,-3.292814,48.803885
2019-274155,2019-01-25,000001,Vente,22000,,,LOGUEL MONICOT,B938,22710,22166,Penvénan,22,,,221660000B1199,,,,,,,,,,,,,0,,,,,AB,terrains a bâtir,,,27,-3.292963,48.803831
2019-274220,2019-01-28,000001,Vente,126000,13,,RUE DES PERDRIX,0045,22710,22166,Penvénan,22,,,22166000AD0180,,,,,,,,,,,,,0,1,Maison,107,5,S,sols,,,153,-3.294166,48.812117
2019-274220,2019-01-28,000001,Vente,126000,,,LE BOURG,B096,22710,22166,Penvénan,22,,,22166000AD0230,,,,,,,,,,,,,0,,,,,J,jardins,,,393,-3.294198,48.812253
2019-274301,2019-02-06,000001,Vente,140000,5,,RES DE KERILIS VOIE A,A025,22710,22166,Penvénan,22,,,22166000AE0412,,,,,,,,,,,,,0,1,Maison,103,4,S,sols,,,351,-3.297516,48.809459
2019-274379,2019-02-15,000001,Vente,280000,4,,KERGASTEL,B385,22710,22166,Penvénan,22,,,221660000D0988,,,,,,,,,,,,,0,1,Maison,169,7,T,terres,,,430,-3.317857,48.821597
2019-274379,2019-02-15,000001,Vente,280000,4,,KERGASTEL,B385,22710,22166,Penvénan,22,,,221660000D0988,,,,,,,,,,,,,0,1,Maison,169,7,S,sols,,,500,-3.317857,48.821597
2019-274379,2019-02-15,000001,Vente,280000,4,,KERGASTEL,B385,22710,22166,Penvénan,22,,,221660000D0988,,,,,,,,,,,,,0,1,Maison,169,7,AG,terrains d'agrément,,,2000,-3.317857,48.821597
2019-274379,2019-02-15,000001,Vente,280000,,,CRECH KERGASTEL,B237,22710,22166,Penvénan,22,,,221660000D0989,,,,,,,,,,,,,0,,,,,L,landes,,,2724,-3.317019,48.821711
2019-274390,2019-02-21,000001,Vente,140000,6,,RUE DES BRUYERES,0008,22710,22166,Penvénan,22,,,221660000A2036,,,,,,,,,,,,,0,1,Maison,65,2,S,sols,,,1007,-3.283107,48.827596
2019-274460,2019-03-04,000001,Vente,180000,2,,PL DE L'EGLISE,0016,22710,22166,Penvénan,22,,,22166000AE0050,,,,,,,,,,,,,0,4,Local industriel. commercial ou assimilé,125,0,S,sols,,,123,-3.295481,48.811738
2019-274460,2019-03-04,000001,Vente,180000,2,,PL DE L'EGLISE,0016,22710,22166,Penvénan,22,,,22166000AE0050,,,,,,,,,,,,,0,1,Maison,68,4,S,sols,,,123,-3.295481,48.811738
2019-274460,2019-03-04,000001,Vente,180000,,,LE BOURG,B096,22710,22166,Penvénan,22,,,22166000AE0190,,,,,,,,,,,,,0,,,,,S,sols,,,565,,
2019-274460,2019-03-04,000001,Vente,180000,,,LE BOURG,B096,22710,22166,Penvénan,22,,,22166000AE0451,,,,,,,,,,,,,0,,,,,AG,terrains d'agrément,,,573,,
2019-274492,2019-02-28,000001,Vente,439300,27,,CRECH GOULARD,B231,22710,22166,Penvénan,22,,,221660000D1224,,,,,,,,,,,,,0,1,Maison,160,4,T,terres,,,2096,-3.326816,48.823881
2019-274539,2019-03-18,000001,Vente,1,10,,RUE DE LA POSTE,0050,22710,22166,Penvénan,22,,,22166000AD0469,,,,,,,,,,,,,0,,,,,S,sols,,,6,-3.295285,48.812589
2019-274541,2019-03-07,000001,Vente,125000,12,,RUE AMIRAL DE CUVERVILLE,0068,22710,22166,Penvénan,22,,,221660000E0578,,,,,,,,,,,,,0,1,Maison,111,3,S,sols,,,432,-3.298526,48.823739
2019-274541,2019-03-07,000001,Vente,125000,12,,RUE AMIRAL DE CUVERVILLE,0068,22710,22166,Penvénan,22,,,221660000E0578,,,,,,,,,,,,,0,3,Dépendance,,0,S,sols,,,432,-3.298526,48.823739
2019-274541,2019-03-07,000001,Vente,125000,,,LIORS MAUDEZ,B703,22710,22166,Penvénan,22,,,221660000E0976,,,,,,,,,,,,,0,,,,,T,terres,,,120,-3.298499,48.823677
2019-274571,2019-03-28,000001,Vente,300666.66,,,LE PORT BLANC,C716,22710,22166,Penvénan,22,,,22166000AC0123,,,,,,,,,,,,,0,,,,,AG,terrains d'agrément,,,769,-3.311016,48.834653
2019-274571,2019-03-28,000001,Vente,300666.66,3,,RUE EDOUARD DONZELOT,0017,22710,22166,Penvénan,22,,,22166000AC0124,,,,,,,,,,,,,0,1,Maison,220,7,S,sols,,,1007,-3.311006,48.834421
2019-274622,2019-03-14,000001,Vente,105000,3,,RUE DE CRECH AVEL,0078,22710,22166,Penvénan,22,,,22166000AB0056,,,,,,,,,,,,,0,1,Maison,99,4,S,sols,,,575,-3.326035,48.832663
2019-274632,2019-03-04,000001,Vente,230000,16,,RUE DES AGAPANTHES,0073,22710,22166,Penvénan,22,,,221660000E1533,,,,,,,,,,,,,0,1,Maison,90,4,S,sols,,,683,-3.306373,48.830314
2019-274636,2019-04-02,000001,Vente,52000,,,LOGUEL CROAS TRENT,B855,22710,22166,Penvénan,22,,,221660000B1198,,,,,,,,,,,,,0,,,,,AB,terrains a bâtir,,,800,-3.29248,48.804436
2019-274641,2019-03-25,000001,Vente,52900,,,POUL FANC,C722,22710,22166,Penvénan,22,,,221660000C1398,,,,,,,,,,,,,0,,,,,AB,terrains a bâtir,,,710,-3.304944,48.80741
2019-274647,2019-04-05,000001,Vente,39900,3,,IMP POUL FANC,0170,22710,22166,Penvénan,22,,,221660000C1396,,,,,,,,,,,,,0,1,Maison,76,4,AB,terrains a bâtir,,,518,-3.304544,48.807725
2019-274651,2019-03-28,000001,Vente,50000,,,LANO MEUR,B551,22710,22166,Penvénan,22,,,221660000A2210,,,,,,,,,,,,,0,,,,,AB,terrains a bâtir,,,760,-3.281636,48.83072
2019-274652,2019-03-26,000001,Vente,165000,4,,RUE DES COMPAGNONS,0142,22710,22166,Penvénan,22,,,221660000C1070,,,,,,,,,,,,,0,3,Dépendance,,0,S,sols,,,1000,-3.307073,48.804791
2019-274652,2019-03-26,000001,Vente,165000,4,,RUE DES COMPAGNONS,0142,22710,22166,Penvénan,22,,,221660000C1070,,,,,,,,,,,,,0,1,Maison,48,2,S,sols,,,1000,-3.307073,48.804791
2019-274652,2019-03-26,000001,Vente,165000,,,ISSUE PRAT GOAGUEL,B333,22710,22166,Penvénan,22,,,221660000C1256,,,,,,,,,,,,,0,,,,,AB,terrains a bâtir,,,1518,-3.306756,48.804699
2019-274793,2019-04-05,000001,Vente,58500,,,POUL FANC,C722,22710,22166,Penvénan,22,,,221660000C1394,,,,,,,,,,,,,0,,,,,AB,terrains a bâtir,,,799,-3.3042,48.807561
2019-274793,2019-04-05,000001,Vente,58500,60,,RUE DE LANNION,0026,22710,22166,Penvénan,22,,,221660000C1401,,,,,,,,,,,,,0,,,,,AB,terrains a bâtir,,,9,-3.304411,48.807412
2019-274827,2019-04-09,000001,Vente,160000,,,LIORS COURTES PON,B617,22710,22166,Penvénan,22,,,221660000D0374,,,,,,,,,,,,,0,,,,,T,terres,,,1094,-3.318675,48.82789
2019-274827,2019-04-09,000001,Vente,160000,6,,LIORS COURTES,B616,22710,22166,Penvénan,22,,,221660000D0375,,,,,,,,,,,,,0,1,Maison,70,3,S,sols,,,837,-3.319307,48.827782
2019-274829,2019-04-08,000001,Vente,142000,5,,RUE D'ARMOR,0005,22710,22166,Penvénan,22,,,22166000AD0087,,,,,,,,,,,,,0,1,Maison,55,3,S,sols,,,143,-3.295403,48.813818
2019-274885,2019-05-07,000001,Vente,273000,3,,RES ST GILDAS,A036,22710,22166,Penvénan,22,,,22166000AB0491,,,,,,,,,,,,,0,1,Maison,70,3,S,sols,,,1041,-3.318556,48.834169
2019-274894,2019-04-29,000001,Vente,122000,6,,RUE DE LA GARE,0020,22710,22166,Penvénan,22,,,221660000B0774,,,,,,,,,,,,,0,1,Maison,73,3,S,sols,,,921,-3.294081,48.804775
2019-274924,2019-04-30,000001,Vente,138000,15,,KERDAVID,B379,22710,22166,Penvénan,22,,,22166000AC0350,,,,,,,,,,,,,0,1,Maison,74,4,S,sols,,,458,-3.305903,48.83235
2019-274935,2019-04-26,000001,Vente,180000,10,,SEMAPHORE,C921,22710,22166,Penvénan,22,,,221660000E1138,,,,,,,,,,,,,0,1,Maison,87,3,S,sols,,,831,-3.303033,48.828096
2019-274935,2019-04-26,000001,Vente,180000,,,PARC VILIN AVEL,C651,22710,22166,Penvénan,22,,,221660000E1140,,,,,,,,,,,,,0,,,,,T,terres,,,48,-3.302922,48.828141
2019-274939,2019-04-30,000001,Vente,230000,20,,RUE ANDRE CHEVRILLON,0004,22710,22166,Penvénan,22,,,22166000AC0043,,,,,,,,,,,,,0,1,Maison,97,5,S,sols,,,969,-3.309456,48.834583
2019-275048,2019-05-07,000001,Vente,86000,,,CRECH MORVAN,B244,22710,22166,Penvénan,22,,,22166000AB0816,,,,,,,,,,,,,0,,,,,J,jardins,,,71,-3.322621,48.833384
2019-275048,2019-05-07,000001,Vente,86000,5915,,CRECH MORVAN,B244,22710,22166,Penvénan,22,,,22166000AB0817,,,,,,,,,,,,,0,4,Local industriel. commercial ou assimilé,94,0,S,sols,,,351,-3.322579,48.833312
2019-275048,2019-05-07,000001,Vente,86000,5915,,CRECH MORVAN,B244,22710,22166,Penvénan,22,,,22166000AB0817,,,,,,,,,,,,,0,1,Maison,67,3,S,sols,,,351,-3.322579,48.833312
2019-275056,2019-05-10,000001,Vente,203540,30,B,RUE DE PEN CRECH,0044,22710,22166,Penvénan,22,,,221660000A2117,,,,,,,,,,,,,0,1,Maison,107,4,AG,terrains d'agrément,,,1300,-3.28776,48.818145
2019-275056,2019-05-10,000001,Vente,203540,30,B,RUE DE PEN CRECH,0044,22710,22166,Penvénan,22,,,221660000A2117,,,,,,,,,,,,,0,1,Maison,107,4,S,sols,,,600,-3.28776,48.818145
2019-275056,2019-05-10,000001,Vente,203540,,,LIORS BRAS,B603,22710,22166,Penvénan,22,,,221660000A2118,,,,,,,,,,,,,0,,,,,T,terres,,,373,-3.287918,48.8186
2019-275072,2019-05-27,000001,Vente,21489,,,LOGUEL AN GRANEC,B760,22710,22166,Penvénan,22,,,221660000D0610,,,,,,,,,,,,,0,,,,,T,terres,,,1790,-3.323991,48.821073
2019-275072,2019-05-27,000001,Vente,21489,,,PARC AR BRUN,C227,22710,22166,Penvénan,22,,,221660000D0622,,,,,,,,,,,,,0,,,,,T,terres,,,14740,-3.326718,48.822314
2019-275100,2019-05-13,000001,Vente,1,,,PARC KERGEFFROY,C475,22710,22166,Penvénan,22,,,221660000C0868,,,,,,,,,,,,,0,,,,,S,sols,,,150,-3.298383,48.802399
2019-275101,2019-05-13,000002,Vente,53399,10,,KER GEFFROY,B357,22710,22166,Penvénan,22,,,221660000C0376,,,,,,,,,,,,,0,1,Maison,80,3,S,sols,,,88,-3.298281,48.802452
2019-275101,2019-05-13,000002,Vente,53399,,,PARC KERGEFFROY,C475,22710,22166,Penvénan,22,,,221660000C0901,,,,,,,,,,,,,0,,,,,T,terres,,,24,-3.298363,48.802486
2019-275212,2019-05-29,000001,Vente,52900,,,POUL FANC,C722,22710,22166,Penvénan,22,,,221660000C1395,,,,,,,,,,,,,0,,,,,AB,terrains a bâtir,,,705,-3.304315,48.807781
2019-275230,2019-06-05,000001,Echange,175000,,,JOUDOLEINIER,B353,22710,22166,Penvénan,22,,,221660000C0705,,,,,,,,,,,,,0,,,,,L,landes,,,1417,-3.325422,48.798677
2019-275230,2019-06-05,000001,Echange,175000,,,JOUDOLEINIER,B353,22710,22166,Penvénan,22,,,221660000C0706,,,,,,,,,,,,,0,,,,,T,terres,,,853,-3.324953,48.79907
2019-275230,2019-06-05,000001,Echange,175000,,,LANEC BRAS KERMIN,B441,22710,22166,Penvénan,22,,,221660000C0724,,,,,,,,,,,,,0,,,,,T,terres,,,13490,-3.325397,48.798102
2019-275230,2019-06-05,000001,Echange,175000,,,LANNEC BIHAN,B520,22710,22166,Penvénan,22,,,221660000C0733,,,,,,,,,,,,,0,,,,,L,landes,,,4790,-3.325262,48.795798
2019-275230,2019-06-05,000001,Echange,175000,,,LOGUEL AN FOUS,B758,22710,22166,Penvénan,22,,,221660000C0734,,,,,,,,,,,,,0,,,,,T,terres,,,3460,-3.32624,48.795609
2019-275230,2019-06-05,000001,Echange,175000,,,PARC AN GAREC,C158,22710,22166,Penvénan,22,,,221660000C0735,,,,,,,,,,,,,0,,,,,L,landes,,,900,-3.325714,48.795486
2019-275230,2019-06-05,000001,Echange,175000,,,PARC AN GAREC,C158,22710,22166,Penvénan,22,,,221660000C0736,,,,,,,,,,,,,0,,,,,T,terres,,,9040,-3.325338,48.795099
2019-275230,2019-06-05,000001,Echange,175000,,,CONVENANT AR CHOAT,B173,22710,22166,Penvénan,22,,,221660000C0743,,,,,,,,,,,,,0,,,,,T,terres,,,5408,-3.327216,48.795984
2019-275230,2019-06-05,000001,Echange,175000,,,CONVENANT AR CHOAT,B173,22710,22166,Penvénan,22,,,221660000C0744,,,,,,,,,,,,,0,,,,,L,landes,,,987,-3.326357,48.795966
2019-275230,2019-06-05,000001,Echange,175000,,,LOGUEL DREC AN TY,B861,22710,22166,Penvénan,22,,,221660000C0745,,,,,,,,,,,,,0,,,,,T,terres,,,2644,-3.326423,48.796134
2019-275230,2019-06-05,000001,Echange,175000,,,LOGUEL MEZO MOHER,B931,22710,22166,Penvénan,22,,,221660000C0746,,,,,,,,,,,,,0,,,,,BS,taillis sous futaie,,,1180,-3.325625,48.796299
2019-275230,2019-06-05,000001,Echange,175000,,,PARC MEZ GUEN,C533,22710,22166,Penvénan,22,,,221660000C0747,,,,,,,,,,,,,0,,,,,T,terres,,,11740,-3.326349,48.796863
2019-275230,2019-06-05,000001,Echange,175000,,,PARC QUERCH,C612,22710,22166,Penvénan,22,,,221660000C0748,,,,,,,,,,,,,0,,,,,T,terres,,,8263,-3.32789,48.796442
2019-275230,2019-06-05,000001,Echange,175000,,,PARC QUERCH,C612,22710,22166,Penvénan,22,,,221660000C0749,,,,,,,,,,,,,0,,,,,T,terres,,,4797,-3.328042,48.79703
2019-275230,2019-06-05,000001,Echange,175000,,,PARC QUERCH,C612,22710,22166,Penvénan,22,,,221660000C0750,,,,,,,,,,,,,0,,,,,BS,taillis sous futaie,,,930,-3.328431,48.796798
2019-275230,2019-06-05,000001,Echange,175000,,,COAT TAIL BIHAN,B165,22710,22166,Penvénan,22,,,221660000C0751,,,,,,,,,,,,,0,,,,,L,landes,,,6100,-3.329351,48.796644
2019-275230,2019-06-05,000001,Echange,175000,,,COAT TAIL BRAS,B166,22710,22166,Penvénan,22,,,221660000C0752,,,,,,,,,,,,,0,,,,,T,terres,,,4894,-3.329903,48.79693
2019-275230,2019-06-05,000001,Echange,175000,,,COAT TAIL BRAS,B166,22710,22166,Penvénan,22,,,221660000C0753,,,,,,,,,,,,,0,,,,,L,landes,,,4141,-3.328967,48.797461
2019-275230,2019-06-05,000001,Echange,175000,,,PARC RU,C622,22710,22166,Penvénan,22,,,221660000C0754,,,,,,,,,,,,,0,,,,,T,terres,,,4847,-3.328468,48.797686
2019-275230,2019-06-05,000001,Echange,175000,,,LAN RU,B423,22710,22166,Penvénan,22,,,221660000C0755,,,,,,,,,,,,,0,,,,,T,terres,,,4636,-3.327869,48.797854
2019-275230,2019-06-05,000001,Echange,175000,,,LAN RU,B423,22710,22166,Penvénan,22,,,221660000C0756,,,,,,,,,,,,,0,,,,,L,landes,,,1504,-3.327371,48.797517
2019-275230,2019-06-05,000001,Echange,175000,,,PARC AN GAO BRAS,C157,22710,22166,Penvénan,22,,,221660000C0759,,,,,,,,,,,,,0,,,,,T,terres,,,13288,-3.328072,48.798702
2019-275230,2019-06-05,000001,Echange,175000,,,LANEC COAT,B447,22710,22166,Penvénan,22,,,221660000C0760,,,,,,,,,,,,,0,,,,,T,terres,,,13296,-3.329588,48.798642
2019-275230,2019-06-05,000001,Echange,175000,,,PRAT IZELLAN,C815,22710,22166,Penvénan,22,,,221660000C0763,,,,,,,,,,,,,0,,,,,P,prés,,,5810,-3.330949,48.796782
2019-275230,2019-06-05,000001,Echange,175000,,,PARC GUEN GUIN,C425,22710,22166,Penvénan,22,,,221660000C0767,,,,,,,,,,,,,0,,,,,T,terres,,,12802,-3.328731,48.799384
2019-275287,2019-06-14,000001,Vente,168000,24,,RUE DU GENERAL DE GAULLE,0021,22710,22166,Penvénan,22,,,22166000AE0126,,,,,,,,,,,,,0,1,Maison,100,5,S,sols,,,513,-3.295791,48.810534
2019-275323,2019-06-27,000001,Vente,160000,5,,RES DIRAG AR MOR,A015,22710,22166,Penvénan,22,,,221660000A1694,,,,,,,,,,,,,0,1,Maison,133,6,S,sols,,,813,-3.282069,48.834256
2019-275340,2019-06-28,000001,Vente,126000,20,,RUE DE LOGUELLOU,0031,22710,22166,Penvénan,22,,,221660000B0754,,,,,,,,,,,,,0,1,Maison,108,6,S,sols,,,570,-3.289317,48.814878
2019-275340,2019-06-28,000001,Vente,126000,,,PRAT ISSUE,C813,22710,22166,Penvénan,22,,,221660000B0954,,,,,,,,,,,,,0,,,,,P,prés,,,249,-3.288954,48.814708
2019-275340,2019-06-28,000001,Vente,126000,,,PARC LORGUEN,C506,22710,22166,Penvénan,22,,,221660000B1004,,,,,,,,,,,,,0,,,,,T,terres,,,638,-3.289112,48.814607
2019-275351,2019-06-19,000001,Vente,186001,52,,CRECH GOULARD,B231,22710,22166,Penvénan,22,,,221660000D0985,,,,,,,,,,,,,0,1,Maison,108,6,L,landes,,,661,-3.331865,48.822255
2019-275351,2019-06-19,000001,Vente,186001,52,,CRECH GOULARD,B231,22710,22166,Penvénan,22,,,221660000D0985,,,,,,,,,,,,,0,1,Maison,108,6,S,sols,,,500,-3.331865,48.822255
2019-275392,2019-07-01,000001,Vente,230000,6,,RUE DES ARMERIAS,0133,22710,22166,Penvénan,22,,,221660000E1432,,,,,,,,,,,,,0,1,Maison,125,5,S,sols,,,763,-3.306222,48.830943
2019-275400,2019-07-05,000001,Vente,171100,4,,RUE DES DUNES,0012,22710,22166,Penvénan,22,,,221660000D1257,,,,,,,,,,,,,0,1,Maison,104,5,S,sols,,,637,-3.321293,48.830693
2019-275400,2019-07-05,000001,Vente,171100,,,CRECH MIN PON,B243,22710,22166,Penvénan,22,,,221660000D1260,,,,,,,,,,,,,0,,,,,T,terres,,,784,-3.321058,48.830726
2019-275420,2019-07-06,000001,Vente,205000,7,,RUE DU MENHIR,0035,22710,22166,Penvénan,22,,,22166000AD0139,,,,,,,,,,,,,0,,,,,J,jardins,,,678,-3.293223,48.814683
2019-275420,2019-07-06,000001,Vente,205000,7,,RUE DU MENHIR,0035,22710,22166,Penvénan,22,,,22166000AD0140,,,,,,,,,,,,,0,1,Maison,158,4,S,sols,,,236,-3.293305,48.814825
2019-275438,2019-07-04,000001,Vente,3877,,,AR LIORS HUELLAN,B056,22710,22166,Penvénan,22,,,221660000C1339,,,,,,,,,,,,,0,,,,,T,terres,,,3877,-3.31459,48.80537
2019-275523,2019-07-10,000001,Vente,22000,,,LOGUEL QUELLENEC,B992,22710,22166,Penvénan,22,,,221660000A1311,,,,,,,,,,,,,0,,,,,T,terres,,,3450,-3.275748,48.819946
2019-275523,2019-07-10,000001,Vente,22000,,,LOGUEL PEN ALLAN,B958,22710,22166,Penvénan,22,,,221660000A1320,,,,,,,,,,,,,0,,,,,T,terres,,,2081,-3.276275,48.819262
2019-275523,2019-07-10,000001,Vente,22000,,,PEN LEN,C694,22710,22166,Penvénan,22,,,221660000A1321,,,,,,,,,,,,,0,,,,,VE,vergers,,,925,-3.275334,48.81937
2019-275523,2019-07-10,000001,Vente,22000,,,PEN LEN,C694,22710,22166,Penvénan,22,,,221660000A2107,,,,,,,,,,,,,0,,,,,T,terres,,,10183,-3.276442,48.818683
2019-275600,2019-07-16,000001,Vente,3511,,,PRAT AND BORN POU,C756,22710,22166,Penvénan,22,,,221660000D0015,,,,,,,,,,,,,0,,,,,P,prés,,,4940,-3.329859,48.826807
2019-275600,2019-07-16,000001,Vente,3511,,,JARDIN CROAS GUER LOUIS,B346,22710,22166,Penvénan,22,,,221660000D0016,,,,,,,,,,,,,0,,,,,T,terres,,,362,-3.329111,48.82674
2019-275600,2019-07-16,000001,Vente,3511,,,LIORS ENEL BORN,B640,22710,22166,Penvénan,22,,,221660000D0018,,,,,,,,,,,,,0,,,,,P,prés,,,730,-3.329671,48.826368
2019-275600,2019-07-16,000001,Vente,3511,,,PRAT DAOU ANTER,C795,22710,22166,Penvénan,22,,,221660000D0176,,,,,,,,,,,,,0,,,,,BS,taillis sous futaie,,,414,-3.329199,48.827054
2019-275605,2019-07-16,000001,Vente,80000,18,,RUE DU GENERAL DE GAULLE,0021,22710,22166,Penvénan,22,,,22166000AE0240,,,,,,,,,,,,,0,4,Local industriel. commercial ou assimilé,64,0,S,sols,,,223,-3.295769,48.810867
2019-275640,2019-07-01,000001,Vente,300000,13,,RUE DES MOUETTES,0039,22710,22166,Penvénan,22,,,221660000A1344,,,,,,,,,,,,,0,1,Maison,80,4,S,sols,,,819,-3.282494,48.832433
2019-275700,2019-07-29,000001,Vente,315000,,,LOGUEL AN QUERO,B780,22710,22166,Penvénan,22,,,221660000B0258,,,,,,,,,,,,,0,,,,,T,terres,,,2126,-3.27771,48.80879
2019-275700,2019-07-29,000001,Vente,315000,,,AL LIORS,B005,22710,22166,Penvénan,22,,,221660000B0281,,,,,,,,,,,,,0,,,,,T,terres,,,4860,-3.278203,48.808455
2019-275700,2019-07-29,000001,Vente,315000,1,,KER FENTET,B356,22710,22166,Penvénan,22,,,221660000B0282,,,,,,,,,,,,,0,1,Maison,184,7,S,sols,,,518,-3.278105,48.808918
2019-275700,2019-07-29,000001,Vente,315000,,,PARC AN POUL,C196,22710,22166,Penvénan,22,,,221660000B0770,,,,,,,,,,,,,0,,,,,T,terres,,,955,-3.278498,48.808721
2019-275738,2019-07-26,000002,Vente,122224.8,,,LE BOURG,B096,22710,22166,Penvénan,22,,,22166000AE0354,,,,,,,,,,,,,0,,,,,T,terres,,,2600,-3.298317,48.808667
2019-275749,2019-08-02,000001,Vente,340000,9,B,RTE DE GOUERMEL,0023,22710,22166,Penvénan,22,,,221660000A0454,,,,,,,,,,,,,0,3,Dépendance,,0,T,terres,,,1483,-3.276568,48.836597
2019-275749,2019-08-02,000001,Vente,340000,9,B,RTE DE GOUERMEL,0023,22710,22166,Penvénan,22,,,221660000A0454,,,,,,,,,,,,,0,3,Dépendance,,0,S,sols,,,500,-3.276568,48.836597
2019-275749,2019-08-02,000001,Vente,340000,9,,RTE DE GOUERMEL,0023,22710,22166,Penvénan,22,,,221660000A0455,,,,,,,,,,,,,0,1,Maison,76,4,S,sols,,,177,-3.276392,48.83646
2019-275749,2019-08-02,000001,Vente,340000,,,BUGUELES,B102,22710,22166,Penvénan,22,,,221660000A0456,,,,,,,,,,,,,0,,,,,L,landes,,,257,-3.276426,48.836335
2019-275749,2019-08-02,000001,Vente,340000,,,KERDANO,B378,22710,22166,Penvénan,22,,,221660000A0457,,,,,,,,,,,,,0,,,,,L,landes,,,351,-3.27666,48.83631
2019-275749,2019-08-02,000001,Vente,340000,,,KERDANO,B378,22710,22166,Penvénan,22,,,221660000A0458,,,,,,,,,,,,,0,,,,,T,terres,,,1588,-3.277032,48.836348
2019-275787,2019-08-29,000001,Vente,189000,10,,RUE DE LA CORNICHE,0077,22710,22166,Penvénan,22,,,221660000D0325,,,,,,,,,,,,,0,1,Maison,78,3,S,sols,,,500,-3.322313,48.828646
2019-275787,2019-08-29,000001,Vente,189000,10,,RUE DE LA CORNICHE,0077,22710,22166,Penvénan,22,,,221660000D0325,,,,,,,,,,,,,0,1,Maison,78,3,J,jardins,,,832,-3.322313,48.828646
2019-275919,2019-08-29,000001,Vente,59900,,,POUL FANC,C722,22710,22166,Penvénan,22,,,221660000C1397,,,,,,,,,,,,,0,,,,,AB,terrains a bâtir,,,997,-3.305006,48.807604
2019-275925,2019-09-02,000001,Vente,149000,5,,RUE DU GENERAL DE GAULLE,0021,22710,22166,Penvénan,22,,,22166000AE0057,,,,,,,,,,,,,0,1,Maison,76,3,S,sols,,,123,-3.295458,48.81151
2019-275925,2019-09-02,000001,Vente,149000,5,,RUE DU GENERAL DE GAULLE,0021,22710,22166,Penvénan,22,,,22166000AE0057,,,,,,,,,,,,,0,4,Local industriel. commercial ou assimilé,44,0,S,sols,,,123,-3.295458,48.81151
2019-275925,2019-09-02,000001,Vente,149000,,,LE BOURG,B096,22710,22166,Penvénan,22,,,22166000AE0192,,,,,,,,,,,,,0,,,,,S,sols,,,100,-3.295297,48.811485
2019-275934,2019-09-11,000001,Vente,120000,20,,RUE DE LA POSTE,0050,22710,22166,Penvénan,22,,,22166000AD0161,,,,,,,,,,,,,0,1,Maison,82,3,S,sols,,,195,-3.295046,48.813042
2019-275934,2019-09-11,000001,Vente,120000,,,LE BOURG,B096,22710,22166,Penvénan,22,,,22166000AD0209,,,,,,,,,,,,,0,,,,,S,sols,,,61,-3.294947,48.81305
2019-275945,2019-09-10,000001,Vente,380000,2,,RUE RADEN,0051,22710,22166,Penvénan,22,,,221660000A2283,,,,,,,,,,,,,0,1,Maison,115,4,S,sols,,,500,-3.282035,48.83403
2019-275945,2019-09-10,000001,Vente,380000,2,,RUE RADEN,0051,22710,22166,Penvénan,22,,,221660000A2283,,,,,,,,,,,,,0,1,Maison,115,4,J,jardins,,,1707,-3.282035,48.83403
2019-275953,2019-08-22,000001,Vente,347000,,,LIORS KERUE,B692,22710,22166,Penvénan,22,,,221660000A0578,,,,,,,,,,,,,0,,,,,T,terres,,,6988,-3.286294,48.836282
2019-275953,2019-08-22,000001,Vente,347000,,,KERRUE,B408,22710,22166,Penvénan,22,,,221660000A0580,,,,,,,,,,,,,0,,,,,J,jardins,,,410,-3.285589,48.836188
2019-275953,2019-08-22,000001,Vente,347000,7,,RUE DE L ILE MARQUER,0054,22710,22166,Penvénan,22,,,221660000A0581,,,,,,,,,,,,,0,1,Maison,59,2,S,sols,,,305,-3.285491,48.83637
2019-275956,2019-09-13,000002,Vente,15000,45,,RUE DE PEN CRECH,0044,22710,22166,Penvénan,22,,,221660000A2317,,,,,,,,,,,,,0,,,,,T,terres,,,56,-3.287849,48.819866
2019-275956,2019-09-13,000002,Vente,15000,,,PARC AR PAPE,C279,22710,22166,Penvénan,22,,,221660000A2325,,,,,,,,,,,,,0,,,,,T,terres,,,84,-3.28772,48.819962
2019-275979,2019-09-03,000001,Vente,200000,4,,RES DIRAG AR MOR,A015,22710,22166,Penvénan,22,,,221660000A1698,,,,,,,,,,,,,0,1,Maison,84,4,S,sols,,,848,-3.281889,48.834841
2019-276069,2019-09-26,000001,Vente,270200,5,,RUE LINDBERGH,0029,22710,22166,Penvénan,22,,,221660000A0226,,,,,,,,,,,,,0,1,Maison,95,4,S,sols,,,194,-3.281053,48.839335
2019-276069,2019-09-26,000001,Vente,270200,,,BUGUELES,B102,22710,22166,Penvénan,22,,,221660000A0227,,,,,,,,,,,,,0,,,,,J,jardins,,,585,-3.281105,48.839168
2019-276097,2019-09-26,000001,Vente,136000,26,,RUE DE LANNION,0026,22710,22166,Penvénan,22,,,22166000AE0020,,,,,,,,,,,,,0,1,Maison,70,3,S,sols,,,516,-3.299446,48.809969
2019-276163,2019-10-09,000001,Vente,299485,2,,RUE DES PERDRIX,0045,22710,22166,Penvénan,22,,,22166000AE0051,,,2,94.84,,,,,,,,,1,1,Maison,38,1,,,,,,-3.295464,48.811791
2019-276163,2019-10-09,000001,Vente,299485,1,,PL DE L'EGLISE,0016,22710,22166,Penvénan,22,,,22166000AE0051,,,1,95.92,,,,,,,,,1,1,Maison,66,2,,,,,,-3.295464,48.811791
2019-276163,2019-10-09,000001,Vente,299485,1,,PL DE L'EGLISE,0016,22710,22166,Penvénan,22,,,22166000AE0051,,,1,95.92,,,,,,,,,1,4,Local industriel. commercial ou assimilé,225,0,,,,,,-3.295464,48.811791
2019-276163,2019-10-09,000001,Vente,299485,2,,RUE DES PERDRIX,0045,22710,22166,Penvénan,22,,,22166000AE0051,,,2,94.84,,,,,,,,,1,1,Maison,55,2,,,,,,-3.295464,48.811791
2019-276176,2019-09-27,000001,Vente,350000,,,LIORS PEN CRECH,B718,22710,22166,Penvénan,22,,,221660000A0906,,,,,,,,,,,,,0,,,,,VE,vergers,,,880,-3.288813,48.819911
2019-276176,2019-09-27,000001,Vente,350000,52,,RUE DE LEUR MIN,0028,22710,22166,Penvénan,22,,,221660000A1386,,,,,,,,,,,,,0,1,Maison,130,5,J,jardins,,,610,-3.289392,48.820491