id_mutation,date_mutation,numero_disposition,nature_mutation,valeur_fonciere,adresse_numero,adresse_suffixe,adresse_nom_voie,adresse_code_voie,code_postal,code_commune,nom_commune,code_departement,ancien_code_commune,ancien_nom_commune,id_parcelle,ancien_id_parcelle,numero_volume,lot1_numero,lot1_surface_carrez,lot2_numero,lot2_surface_carrez,lot3_numero,lot3_surface_carrez,lot4_numero,lot4_surface_carrez,lot5_numero,lot5_surface_carrez,nombre_lots,code_type_local,type_local,surface_reelle_bati,nombre_pieces_principales,code_nature_culture,nature_culture,code_nature_culture_speciale,nature_culture_speciale,surface_terrain,longitude,latitude
2019-261344,2019-02-05,000001,Vente,131500,5489,,KERMADEC,B252,22290,22178,Pléhédel,22,,,22178000ZH0035,,,,,,,,,,,,,0,1,Maison,115,5,S,sols,,,599,-3.018358,48.692959
2019-261344,2019-02-05,000001,Vente,131500,5489,,KERMADEC,B252,22290,22178,Pléhédel,22,,,22178000ZH0035,,,,,,,,,,,,,0,1,Maison,115,5,T,terres,,,2924,-3.018358,48.692959
2019-261797,2019-02-22,000001,Vente,28514,,,LIORS MEZ MAREC,B449,22290,22178,Pléhédel,22,,,221780000A0481,,,,,,,,,,,,,0,,,,,T,terres,,,5810,-2.987643,48.705617
2019-261797,2019-02-22,000001,Vente,28514,,,PARC BIAN,B768,22290,22178,Pléhédel,22,,,221780000A0496,,,,,,,,,,,,,0,,,,,T,terres,,,5510,-2.984679,48.705123
2019-261797,2019-02-22,000001,Vente,28514,,,PARC FROLES,B820,22290,22178,Pléhédel,22,,,221780000A0500,,,,,,,,,,,,,0,,,,,T,terres,,,8110,-2.985667,48.704899
2019-261797,2019-02-22,000001,Vente,28514,,,LIORS AD VIN,B338,22290,22178,Pléhédel,22,,,221780000A0501,,,,,,,,,,,,,0,,,,,T,terres,,,7140,-2.986553,48.705111
2019-261797,2019-02-22,000001,Vente,28514,,,LIORS AD FOIN,B318,22290,22178,Pléhédel,22,,,221780000A0502,,,,,,,,,,,,,0,,,,,T,terres,,,5160,-2.987485,48.704936
2019-261797,2019-02-22,000001,Vente,28514,,,PARC BRAS,B775,22290,22178,Pléhédel,22,,,221780000A0514,,,,,,,,,,,,,0,,,,,T,terres,,,8180,-2.987353,48.704024
2019-261797,2019-02-22,000001,Vente,28514,,,LIORS SAIVEC,B479,22290,22178,Pléhédel,22,,,221780000A0516,,,,,,,,,,,,,0,,,,,T,terres,,,6540,-2.986251,48.703921
2019-261797,2019-02-22,000001,Vente,28514,,,PARC PEN LIORS,B959,22290,22178,Pléhédel,22,,,221780000A0518,,,,,,,,,,,,,0,,,,,T,terres,,,5960,-2.984988,48.703851
2019-261797,2019-02-22,000001,Vente,28514,,,LIORS DREG AN TY,B389,22290,22178,Pléhédel,22,,,221780000A1089,,,,,,,,,,,,,0,,,,,T,terres,,,4043,-2.988525,48.704967
2019-261797,2019-02-22,000001,Vente,28514,,,KERLIDIC,B251,22290,22178,Pléhédel,22,,,221780000A1092,,,,,,,,,,,,,0,,,,,S,sols,,,576,-2.98767,48.70467
2019-261993,2019-02-28,000001,Vente,210000,5515,,SAINT FIACRE,C207,22290,22178,Pléhédel,22,,,221780000C0548,,,,,,,,,,,,,0,1,Maison,163,6,S,sols,,,365,-3.007171,48.694349
2019-261993,2019-02-28,000001,Vente,210000,,,PORS SAINT FIACRE,C082,22290,22178,Pléhédel,22,,,221780000C0551,,,,,,,,,,,,,0,,,,,T,terres,,,1646,-3.007198,48.694168
2019-262047,2019-03-01,000001,Vente,1000,,,PENHER,C061,22290,22178,Pléhédel,22,,,22178000ZA0013,,,,,,,,,,,,,0,,,,,T,terres,,,2551,-3.029782,48.692888
2019-262178,2019-03-26,000003,Vente,27500,,,LIORS SIMON,B481,22290,22178,Pléhédel,22,,,221780000B1254,,,,,,,,,,,,,0,,,,,T,terres,,,579,-3.002952,48.697056
2019-262178,2019-03-26,000003,Vente,27500,,,LIORS SIMON,B481,22290,22178,Pléhédel,22,,,221780000B1257,,,,,,,,,,,,,0,,,,,T,terres,,,413,-3.001917,48.696992
2019-262198,2019-03-13,000001,Vente,90000,,,LIORS CREIS,B385,22290,22178,Pléhédel,22,,,221780000C0105,,,,,,,,,,,,,0,,,,,S,sols,,,294,-3.005156,48.686602
2019-262198,2019-03-13,000001,Vente,90000,,,LIORS CREIS,B385,22290,22178,Pléhédel,22,,,221780000C0105,,,,,,,,,,,,,0,,,,,T,terres,,,4631,-3.005156,48.686602
2019-262198,2019-03-13,000001,Vente,90000,,,LE JARDIN,B226,22290,22178,Pléhédel,22,,,221780000C0106,,,,,,,,,,,,,0,,,,,J,jardins,,,440,-3.005091,48.686287
2019-262198,2019-03-13,000001,Vente,90000,5371,,KERCHARLES,B240,22290,22178,Pléhédel,22,,,221780000C0107,,,,,,,,,,,,,0,1,Maison,112,4,S,sols,,,225,-3.00487,48.6863
2019-262204,2019-03-12,000001,Vente,4000,5448,,COURAILLON,B143,22290,22178,Pléhédel,22,,,22178000ZB0095,,,,,,,,,,,,,0,3,Dépendance,,0,T,terres,,,7465,-3.017693,48.704789
2019-262208,2019-03-12,000001,Vente,1800,5653,,COURAILLON,B143,22290,22178,Pléhédel,22,,,22178000ZB0013,,,,,,,,,,,,,0,3,Dépendance,,0,T,terres,,,2907,-3.018654,48.703946
2019-262445,2019-03-25,000001,Vente,94990,5114,,RUE SAINT FIACRE,0382,22290,22178,Pléhédel,22,,,221780000A0877,,,,,,,,,,,,,0,1,Maison,77,5,S,sols,,,240,-3.006701,48.694906
2019-262445,2019-03-25,000001,Vente,94990,,,RUE SAINT FIACRE,0382,22290,22178,Pléhédel,22,,,221780000A1213,,,,,,,,,,,,,0,,,,,AG,terrains d'agrément,,,44,-3.006576,48.694983
2019-262489,2019-03-21,000001,Vente,1,,,QUISTELLEY,C180,22290,22178,Pléhédel,22,,,22178000ZB0160,,,,,,,,,,,,,0,,,,,T,terres,,,3061,-3.015565,48.709213
2019-262489,2019-03-21,000001,Vente,1,,,QUISTELLEY,C180,22290,22178,Pléhédel,22,,,22178000ZB0160,,,,,,,,,,,,,0,,,,,S,sols,,,1345,-3.015565,48.709213
2019-262493,2019-03-21,000001,Vente,40000,5007,,QUISTELLEY,C180,22290,22178,Pléhédel,22,,,22178000ZB0161,,,,,,,,,,,,,0,1,Maison,76,1,S,sols,,,356,-3.015585,48.709175
2019-262699,2019-04-06,000001,Vente,33750,,,COAT FALL,B126,22290,22178,Pléhédel,22,,,221780000B1230,,,,,,,,,,,,,0,,,,,AB,terrains a bâtir,,,750,-3.003488,48.69742
2019-262762,2019-05-03,000001,Vente,5000,,,LIORS AD GOUENEC,B324,22290,22178,Pléhédel,22,,,221780000C0229,,,,,,,,,,,,,0,,,,,T,terres,,,1830,-3.005227,48.685931
2019-262770,2019-04-13,000001,Vente,245000,4,,KERMADEC,B252,22290,22178,Pléhédel,22,,,22178000ZH0060,,,,,,,,,,,,,0,1,Maison,91,5,S,sols,,,500,-3.016419,48.696762
2019-262770,2019-04-13,000001,Vente,245000,4,,KERMADEC,B252,22290,22178,Pléhédel,22,,,22178000ZH0060,,,,,,,,,,,,,0,1,Maison,91,5,AG,terrains d'agrément,,,485,-3.016419,48.696762
2019-262782,2019-04-13,000001,Vente,74000,5480,,TRAOU MEUR,C246,22290,22178,Pléhédel,22,,,22178000ZH0004,,,,,,,,,,,,,0,1,Maison,73,3,S,sols,,,637,-3.019159,48.697375
2019-262812,2019-04-16,000001,Vente,121000,28,,PORS LAN,C081,22290,22178,Pléhédel,22,,,22178000ZB0082,,,,,,,,,,,,,0,1,Maison,124,3,S,sols,,,301,-3.012336,48.702623
2019-262812,2019-04-16,000001,Vente,121000,28,,PORS LAN,C081,22290,22178,Pléhédel,22,,,22178000ZB0082,,,,,,,,,,,,,0,1,Maison,124,3,AG,terrains d'agrément,,,1873,-3.012336,48.702623
2019-262843,2019-04-24,000001,Vente,97000,,,RUE DE LA RESISTANCE,0377,22290,22178,Pléhédel,22,,,221780000A1258,,,,,,,,,,,,,0,,,,,AG,terrains d'agrément,,,166,-3.005531,48.699368
2019-262843,2019-04-24,000001,Vente,97000,5681,,RUE DE LA RESISTANCE,0377,22290,22178,Pléhédel,22,,,221780000A1259,,,,,,,,,,,,,0,1,Maison,73,3,S,sols,,,484,-3.005483,48.699449
2019-262858,2019-04-29,000001,Vente,80000,5181,,RUE DE CORNOUAILLE,0142,22290,22178,Pléhédel,22,,,221780000A0833,,,,,,,,,,,,,0,1,Maison,66,3,S,sols,,,567,-3.011496,48.697614
2019-262858,2019-04-29,000001,Vente,80000,,,LORVESTRE,B590,22290,22178,Pléhédel,22,,,221780000A0840,,,,,,,,,,,,,0,,,,,T,terres,,,655,-3.011288,48.69775
2019-262985,2019-04-27,000001,Vente,80000,,,LIORS SIMON,B481,22290,22178,Pléhédel,22,,,221780000B0018,,,,,,,,,,,,,0,,,,,T,terres,,,2742,-3.002573,48.696809
2019-262985,2019-04-27,000001,Vente,80000,,,LIORS SIMON,B481,22290,22178,Pléhédel,22,,,221780000B0018,,,,,,,,,,,,,0,,,,,S,sols,,,42,-3.002573,48.696809
2019-262985,2019-04-27,000001,Vente,80000,5251,,LE ROHIOU,C185,22290,22178,Pléhédel,22,,,221780000B0896,,,,,,,,,,,,,0,1,Maison,86,3,S,sols,,,120,-3.002803,48.696885
2019-262994,2019-04-27,000001,Vente,22817,,,LE GUELLENEC,B201,22290,22178,Pléhédel,22,,,22178000ZC0078,,,,,,,,,,,,,0,,,,,T,terres,,,7476,-2.998392,48.703883
2019-262994,2019-04-27,000001,Vente,22817,,,LE GUELLENEC,B201,22290,22178,Pléhédel,22,,,22178000ZC0078,,,,,,,,,,,,,0,,,,,T,terres,,,7476,-2.998392,48.703883
2019-262994,2019-04-27,000001,Vente,22817,,,RUNAMUS,C201,22290,22178,Pléhédel,22,,,22178000ZC0096,,,,,,,,,,,,,0,,,,,T,terres,,,20151,-3.001891,48.704773
2019-263756,2019-06-04,000001,Vente,35000,5464,,RUE DE CORNOUAILLE,0142,22290,22178,Pléhédel,22,,,221780000D0190,,,,,,,,,,,,,0,1,Maison,65,1,S,sols,,,180,-3.012882,48.697477
2019-263756,2019-06-04,000001,Vente,35000,,,RUE DE CORNOUAILLE,0142,22290,22178,Pléhédel,22,,,221780000D0191,,,,,,,,,,,,,0,,,,,J,jardins,,,1035,,
2019-263866,2019-06-19,000001,Vente,119000,5482,,TRAOU MEUR,C246,22290,22178,Pléhédel,22,,,22178000ZH0049,,,,,,,,,,,,,0,1,Maison,112,5,S,sols,,,842,-3.021104,48.695484
2019-264328,2019-07-05,000001,Vente,25000,93,,LA JUSTICE,B232,22290,22178,Pléhédel,22,,,22178000ZD0159,,,,,,,,,,,,,0,,,,,AB,terrains a bâtir,,,984,-3.000471,48.687099
2019-264571,2019-07-25,000001,Vente,60000,5496,,LE FAVEN,B181,22290,22178,Pléhédel,22,,,221780000D0976,,,,,,,,,,,,,0,1,Maison,55,1,S,sols,,,459,-3.013116,48.694362
2019-264597,2019-07-19,000001,Vente,27000,,,KERNEVEZ,B258,22290,22178,Pléhédel,22,,,22178000ZD0155,,,,,,,,,,,,,0,,,,,AB,terrains a bâtir,,,713,-2.991601,48.698172
2019-264597,2019-07-19,000001,Vente,27000,,,KERNEVEZ,B258,22290,22178,Pléhédel,22,,,22178000ZD0156,,,,,,,,,,,,,0,,,,,S,sols,,,323,-2.991452,48.698324
2019-264900,2019-08-13,000001,Vente,3000,,,PARC THOMAS BIAN,C036,22290,22178,Pléhédel,22,,,221780000C0040,,,,,,,,,,,,,0,,,,,T,terres,,,5490,-3.011432,48.689134
2019-265148,2019-08-16,000001,Vente,100000,,,AD LIORS,B047,22290,22178,Pléhédel,22,,,221780000B0758,,,,,,,,,,,,,0,,,,,T,terres,,,2240,-2.992424,48.685863
2019-265148,2019-08-16,000001,Vente,100000,,,AD LIORS,B047,22290,22178,Pléhédel,22,,,221780000B0758,,,,,,,,,,,,,0,,,,,S,sols,,,530,-2.992424,48.685863
2019-265148,2019-08-16,000001,Vente,100000,5348,,SAINT MICHEL,C208,22290,22178,Pléhédel,22,,,221780000B0759,,,,,,,,,,,,,0,1,Maison,90,4,S,sols,,,2550,-2.992376,48.685509
2019-265326,2019-08-30,000001,Vente,65000,,,SAINT FIACRE,C207,22290,22178,Pléhédel,22,,,221780000A0705,,,,,,,,,,,,,0,,,,,J,jardins,,,358,-3.006697,48.694325
2019-265326,2019-08-30,000001,Vente,65000,5119,,BEAU REGARD,C284,22290,22178,Pléhédel,22,,,221780000A0706,,,,,,,,,,,,,0,1,Maison,87,3,S,sols,,,187,-3.00685,48.694491
2019-265428,2019-08-31,000001,Vente,105000,5499,,LE FAVEN,B181,22290,22178,Pléhédel,22,,,221780000D0210,,,,,,,,,,,,,0,1,Maison,15,1,AG,terrains d'agrément,,,1268,-3.012658,48.694803
2019-265428,2019-08-31,000001,Vente,105000,5499,,LE FAVEN,B181,22290,22178,Pléhédel,22,,,221780000D0210,,,,,,,,,,,,,0,1,Maison,15,1,S,sols,,,32,-3.012658,48.694803
2019-265428,2019-08-31,000001,Vente,105000,5498,,LE FAVEN,B181,22290,22178,Pléhédel,22,,,221780000D0213,,,,,,,,,,,,,0,1,Maison,76,3,S,sols,,,135,-3.012656,48.694548
2019-265428,2019-08-31,000001,Vente,105000,,,AD LIORS,B047,22290,22178,Pléhédel,22,,,221780000D0894,,,,,,,,,,,,,0,,,,,T,terres,,,18,-3.012742,48.694594
2019-265487,2019-09-30,000001,Vente,125000,5316,,LE POULOUDU,C086,22290,22178,Pléhédel,22,,,221780000B0398,,,,,,,,,,,,,0,1,Maison,88,3,S,sols,,,620,-2.981781,48.698804
2019-266407,2019-10-19,000001,Vente,100000,21,,RUE DE CORNOUAILLE,0142,22290,22178,Pléhédel,22,,,221780000D0199,,,,,,,,,,,,,0,1,Maison,58,3,S,sols,,,667,-3.014114,48.697227
2019-266407,2019-10-19,000001,Vente,100000,,,PRAT BIAN,C115,22290,22178,Pléhédel,22,,,221780000D0200,,,,,,,,,,,,,0,,,,,P,prés,,,390,-3.013981,48.696833
2019-266407,2019-10-19,000001,Vente,100000,,,AD LIORS,B047,22290,22178,Pléhédel,22,,,221780000D0201,,,,,,,,,,,,,0,,,,,T,terres,,,1670,-3.014217,48.696867
2019-266407,2019-10-19,000001,Vente,100000,,,PARC LESCLAUS,B908,22290,22178,Pléhédel,22,,,221780000D0897,,,,,,,,,,,,,0,,,,,T,terres,,,973,-3.014231,48.69655
2019-266585,2019-11-13,000001,Vente,204103,5239,,KERTHEREZIEN,B263,22290,22178,Pléhédel,22,,,22178000ZD0072,,,,,,,,,,,,,0,1,Maison,83,3,S,sols,,,387,-2.994893,48.698758
2019-266585,2019-11-13,000001,Vente,204103,5239,,KERTHEREZIEN,B263,22290,22178,Pléhédel,22,,,22178000ZD0072,,,,,,,,,,,,,0,1,Maison,83,3,AG,terrains d'agrément,,,1355,-2.994893,48.698758
2019-266675,2019-11-09,000001,Vente,255000,5369,,COAT ROBIN,B135,22290,22178,Pléhédel,22,,,221780000C0254,,,,,,,,,,,,,0,1,Maison,243,6,S,sols,,,2600,-3.009358,48.685657
2019-266681,2019-11-08,000001,Vente,137000,19,,RUE DE LA GOELETTE,0160,22290,22178,Pléhédel,22,,,221780000A1025,,,,,,,,,,,,,0,1,Maison,100,4,S,sols,,,355,-3.010668,48.698702
2019-266681,2019-11-08,000001,Vente,137000,19,,RUE DE LA GOELETTE,0160,22290,22178,Pléhédel,22,,,221780000A1025,,,,,,,,,,,,,0,1,Maison,100,4,AG,terrains d'agrément,,,680,-3.010668,48.698702
2019-266728,2019-11-09,000002,Echange,500,27,,KERMADEC,B252,22290,22178,Pléhédel,22,,,221780000D1107,,,,,,,,,,,,,0,,,,,S,sols,,,26,-3.017092,48.692793
2019-266728,2019-11-09,000003,Echange,500,,,KERMADEC,B252,22290,22178,Pléhédel,22,,,221780000D1109,,,,,,,,,,,,,0,,,,,S,sols,,,9,-3.017333,48.692732
2019-266985,2019-11-26,000001,Vente,170000,5,,PL DU PRINTEMPS,0372,22290,22178,Pléhédel,22,,,221780000A0757,,,,,,,,,,,,,0,1,Maison,104,4,S,sols,,,391,-3.009303,48.694863
2019-266985,2019-11-26,000001,Vente,170000,,,PARC PLACEY HEURTERRET,B975,22290,22178,Pléhédel,22,,,221780000A0855,,,,,,,,,,,,,0,,,,,S,sols,,,130,-3.009202,48.694864
2019-266985,2019-11-26,000001,Vente,170000,,,PARC PLACEN,B972,22290,22178,Pléhédel,22,,,221780000A1078,,,,,,,,,,,,,0,,,,,T,terres,,,292,-3.009057,48.694887
2019-266997,2019-11-30,000001,Vente,160550,16,,RUE DU DOCTEUR MAHE,0146,22290,22178,Pléhédel,22,,,221780000A0832,,,,,,,,,,,,,0,1,Maison,88,4,S,sols,,,78,-3.00506,48.697133
2019-266997,2019-11-30,000001,Vente,160550,16,,RUE DU DOCTEUR MAHE,0146,22290,22178,Pléhédel,22,,,221780000A1297,,,,,,,,,,,,,0,,,,,S,sols,,,511,-3.005025,48.697109
2019-267079,2019-12-06,000001,Vente,129000,5465,,RUE DE CORNOUAILLE,0142,22290,22178,Pléhédel,22,,,221780000D0192,,,,,,,,,,,,,0,1,Maison,92,4,S,sols,,,160,-3.013009,48.697481
2019-267079,2019-12-06,000001,Vente,129000,,,RUE DE CORNOUAILLE,0142,22290,22178,Pléhédel,22,,,221780000D0193,,,,,,,,,,,,,0,,,,,S,sols,,,17,-3.013114,48.697385
2019-267079,2019-12-06,000001,Vente,129000,,,RUE DE CORNOUAILLE,0142,22290,22178,Pléhédel,22,,,221780000D0193,,,,,,,,,,,,,0,,,,,AG,terrains d'agrément,,,1098,-3.013114,48.697385
2019-267235,2019-12-06,000001,Vente,155000,5120,,SAINT FIACRE,C207,22290,22178,Pléhédel,22,,,221780000A0704,,,,,,,,,,,,,0,1,Maison,150,5,S,sols,,,628,-3.006678,48.694485
2019-267235,2019-12-06,000001,Vente,155000,,,AD LIORS,B047,22290,22178,Pléhédel,22,,,221780000B1025,,,,,,,,,,,,,0,,,,,S,sols,,,54,-3.006392,48.694219
2019-267235,2019-12-06,000001,Vente,155000,,,AD LIORS,B047,22290,22178,Pléhédel,22,,,221780000B1025,,,,,,,,,,,,,0,,,,,AG,terrains d'agrément,,,1234,-3.006392,48.694219
2019-267390,2019-12-17,000002,Vente,500,,,PARC LEUR,B909,22290,22178,Pléhédel,22,,,221780000D1104,,,,,,,,,,,,,0,,,,,T,terres,,,140,-3.014514,48.697558
2019-267485,2019-12-14,000001,Echange,42480,,,PRAT BIAN,C115,22290,22178,Pléhédel,22,,,221780000A0001,,,,,,,,,,,,,0,,,,,P,prés,,,3775,-3.013622,48.715892
2019-267485,2019-12-14,000001,Echange,42480,,,LOGUEL ROC AD CHAPELLE,B577,22290,22178,Pléhédel,22,,,221780000A0004,,,,,,,,,,,,,0,,,,,T,terres,,,3930,-3.014023,48.715324
2019-267485,2019-12-14,000001,Echange,42480,,,LE ROSCOAT,C188,22290,22178,Pléhédel,22,,,22178000ZB0120,,,,,,,,,,,,,0,,,,,BT,taillis simples,,,5114,-3.01584,48.71348
