id_mutation,date_mutation,numero_disposition,nature_mutation,valeur_fonciere,adresse_numero,adresse_suffixe,adresse_nom_voie,adresse_code_voie,code_postal,code_commune,nom_commune,code_departement,ancien_code_commune,ancien_nom_commune,id_parcelle,ancien_id_parcelle,numero_volume,lot1_numero,lot1_surface_carrez,lot2_numero,lot2_surface_carrez,lot3_numero,lot3_surface_carrez,lot4_numero,lot4_surface_carrez,lot5_numero,lot5_surface_carrez,nombre_lots,code_type_local,type_local,surface_reelle_bati,nombre_pieces_principales,code_nature_culture,nature_culture,code_nature_culture_speciale,nature_culture_speciale,surface_terrain,longitude,latitude
2019-274165,2019-01-18,000001,Vente,187200,4,,RTE DE KERANGLAS,0070,22300,22224,Ploulec'h,22,,,222240000B1425,,,,,,,,,,,,,0,1,Maison,74,4,S,sols,,,1058,-3.505898,48.71973
2019-274250,2019-01-28,000001,Vente,99000,5389,,TIRIENNO,C179,22300,22224,Ploulec'h,22,,,222240000C0882,,,,,,,,,,,,,0,1,Maison,91,4,S,sols,,,360,-3.510639,48.703486
2019-274250,2019-01-28,000001,Vente,99000,5389,,TIRIENNO,C179,22300,22224,Ploulec'h,22,,,222240000C0882,,,,,,,,,,,,,0,1,Maison,91,4,J,jardins,,,1840,-3.510639,48.703486
2019-274250,2019-01-28,000001,Vente,99000,,,TIRIENNO,C179,22300,22224,Ploulec'h,22,,,222240000C1165,,,,,,,,,,,,,0,,,,,T,terres,,,940,-3.509822,48.703333
2019-274250,2019-01-28,000001,Vente,99000,,,TIRIENNO,C179,22300,22224,Ploulec'h,22,,,222240000C1166,,,,,,,,,,,,,0,,,,,BT,taillis simples,,,5736,-3.509122,48.703992
2019-274250,2019-01-28,000001,Vente,99000,,,TIRIENNO,C179,22300,22224,Ploulec'h,22,,,222240000C1167,,,,,,,,,,,,,0,,,,,T,terres,,,88,-3.510117,48.703411
2019-274250,2019-01-28,000001,Vente,99000,,,TIRIENNO,C179,22300,22224,Ploulec'h,22,,,222240000C1168,,,,,,,,,,,,,0,,,,,BT,taillis simples,,,1615,-3.510094,48.703769
2019-274255,2019-01-18,000001,Vente,142000,5400,,PARC PRIGENT,B875,22300,22224,Ploulec'h,22,,,222240000C1148,,,,,,,,,,,,,0,1,Maison,131,6,S,sols,,,880,-3.476523,48.718804
2019-274255,2019-01-18,000001,Vente,142000,5400,,PARC PRIGENT,B875,22300,22224,Ploulec'h,22,,,222240000C1148,,,,,,,,,,,,,0,1,Maison,131,6,J,jardins,,,1078,-3.476523,48.718804
2019-274364,2019-02-08,000001,Vente,319999,3,,IMP DE KERAMPARC,0055,22300,22224,Ploulec'h,22,,,222240000C1241,,,,,,,,,,,,,0,1,Maison,123,4,J,jardins,,,2170,-3.47966,48.718684
2019-274364,2019-02-08,000001,Vente,319999,3,,IMP DE KERAMPARC,0055,22300,22224,Ploulec'h,22,,,222240000C1241,,,,,,,,,,,,,0,1,Maison,123,4,S,sols,,,700,-3.47966,48.718684
2019-274364,2019-02-08,000001,Vente,319999,,,PARC AR PORS,B655,22300,22224,Ploulec'h,22,,,222240000C1243,,,,,,,,,,,,,0,,,,,AB,terrains a bâtir,,,864,-3.479934,48.71798
2019-274364,2019-02-08,000001,Vente,319999,,,PARC AR PORS,B655,22300,22224,Ploulec'h,22,,,222240000C1247,,,,,,,,,,,,,0,,,,,T,terres,,,612,-3.480363,48.717596
2019-274380,2019-02-18,000001,Vente,15000,,,PARC AR VILIN,B673,22300,22224,Ploulec'h,22,,,222240000A0489,,,,,,,,,,,,,0,,,,,T,terres,,,3910,-3.496103,48.729521
2019-274380,2019-02-18,000001,Vente,15000,,,ROZ BIAN,C139,22300,22224,Ploulec'h,22,,,222240000A0490,,,,,,,,,,,,,0,,,,,T,terres,,,2090,-3.495911,48.729227
2019-274380,2019-02-18,000001,Vente,15000,,,ROS BRAS,C132,22300,22224,Ploulec'h,22,,,222240000A0492,,,,,,,,,,,,,0,,,,,T,terres,,,4270,-3.495001,48.729006
2019-274380,2019-02-18,000001,Vente,15000,,,PARC AN ANCIEN,B572,22300,22224,Ploulec'h,22,,,222240000A0514,,,,,,,,,,,,,0,,,,,T,terres,,,7130,-3.495455,48.728601
2019-274380,2019-02-18,000001,Vente,15000,,,PARC ROUZIC,B893,22300,22224,Ploulec'h,22,,,222240000A0999,,,,,,,,,,,,,0,,,,,T,terres,,,8017,-3.4967,48.728166
2019-274411,2019-02-13,000002,Vente,428,1,,RUE DE LA MAIRIE,0092,22300,22224,Ploulec'h,22,,,222240000B1830,,,,,,,,,,,,,0,,,,,S,sols,,,25,-3.503684,48.718489
2019-274426,2019-02-15,000001,Vente,28650,1,,RUE DE PARCOMEUR,0098,22300,22224,Ploulec'h,22,,,222240000B1822,,,,,,,,,,,,,0,,,,,AB,terrains a bâtir,,,462,-3.499816,48.720658
2019-274528,2019-03-25,000001,Vente,142500,6,,LOT MILIN AWEL,A010,22300,22224,Ploulec'h,22,,,222240000A0937,,,,,,,,,,,,,0,1,Maison,120,5,J,jardins,,,413,-3.524583,48.72641
2019-274528,2019-03-25,000001,Vente,142500,6,,LOT MILIN AWEL,A010,22300,22224,Ploulec'h,22,,,222240000A0937,,,,,,,,,,,,,0,1,Maison,120,5,S,sols,,,315,-3.524583,48.72641
2019-274554,2019-03-28,000001,Vente,167000,6,,RTE DU YAUDET,0284,22300,22224,Ploulec'h,22,,,222240000A0706,,,,,,,,,,,,,0,1,Maison,138,7,S,sols,,,1700,-3.527311,48.727329
2019-274554,2019-03-28,000001,Vente,167000,,,LIORS PARAVOEL,B472,22300,22224,Ploulec'h,22,,,222240000A1071,,,,,,,,,,,,,0,,,,,T,terres,,,775,-3.527287,48.72767
2019-274661,2019-03-21,000001,Vente,250860,27,,RTE DU YAUDET,0284,22300,22224,Ploulec'h,22,,,222240000A0112,,,,,,,,,,,,,0,2,Appartement,40,2,S,sols,,,536,-3.532383,48.729323
2019-274661,2019-03-21,000001,Vente,250860,27,,RTE DU YAUDET,0284,22300,22224,Ploulec'h,22,,,222240000A0112,,,,,,,,,,,,,0,2,Appartement,68,4,S,sols,,,536,-3.532383,48.729323
2019-274661,2019-03-21,000001,Vente,250860,27,,RTE DU YAUDET,0284,22300,22224,Ploulec'h,22,,,222240000A0112,,,,,,,,,,,,,0,2,Appartement,30,2,S,sols,,,536,-3.532383,48.729323
2019-274661,2019-03-21,000001,Vente,250860,27,,RTE DU YAUDET,0284,22300,22224,Ploulec'h,22,,,222240000A0112,,,,,,,,,,,,,0,2,Appartement,72,3,S,sols,,,536,-3.532383,48.729323
2019-274961,2019-04-23,000001,Vente,30450,3,,RUE DE PARCOMEUR,0098,22300,22224,Ploulec'h,22,,,222240000B1786,,,,,,,,,,,,,0,,,,,AB,terrains a bâtir,,,61,-3.499729,48.720338
2019-274961,2019-04-23,000001,Vente,30450,3,,RUE DE PARCOMEUR,0098,22300,22224,Ploulec'h,22,,,222240000B1824,,,,,,,,,,,,,0,,,,,AB,terrains a bâtir,,,430,-3.49974,48.720419
2019-275052,2019-05-27,000001,Vente,,,,PARC DON AN TER,B728,22300,22224,Ploulec'h,22,,,222240000C0379,,,,,,,,,,,,,0,,,,,T,terres,,,17210,,
2019-275052,2019-05-27,000001,Vente,,,,PARC AR GAREN,B621,22300,22224,Ploulec'h,22,,,222240000C1361,,,,,,,,,,,,,0,,,,,T,terres,,,4702,,
2019-275178,2019-05-29,000001,Vente,84000,39,,RTE DU YAUDET,0284,22300,22224,Ploulec'h,22,,,222240000A1244,,,,,,,,,,,,,0,,,,,S,sols,,,57,-3.53413,48.729804
2019-275178,2019-05-29,000001,Vente,84000,,,PARC FROST,B736,22300,22224,Ploulec'h,22,,,222240000A1379,,,,,,,,,,,,,0,,,,,S,sols,,,9,-3.534022,48.729752
2019-275178,2019-05-29,000001,Vente,84000,37,,RTE DU YAUDET,0284,22300,22224,Ploulec'h,22,,,222240000A1380,,,,,,,,,,,,,0,1,Maison,24,2,S,sols,,,50,-3.53403,48.729788
2019-275181,2019-06-19,000001,Vente,70000,39,,RTE DU YAUDET,0284,22300,22224,Ploulec'h,22,,,222240000A1243,,,,,,,,,,,,,0,1,Maison,52,3,S,sols,,,77,-3.534121,48.72987
2019-275221,2019-06-13,000001,Vente,800000,,,PARC HAMON BIHAN,B754,22300,22224,Ploulec'h,22,,,222240000A0253,,,,,,,,,,,,,0,,,,,T,terres,,,10890,-3.51124,48.725975
2019-275221,2019-06-13,000001,Vente,800000,,,VALANEC,C199,22300,22224,Ploulec'h,22,,,222240000A0254,,,,,,,,,,,,,0,,,,,T,terres,,,8790,-3.511949,48.725832
2019-275221,2019-06-13,000001,Vente,800000,,,VALANEC,C199,22300,22224,Ploulec'h,22,,,222240000A0255,,,,,,,,,,,,,0,,,,,T,terres,,,15160,-3.512685,48.725653
2019-275221,2019-06-13,000001,Vente,800000,,,VERGER GOZ,C210,22300,22224,Ploulec'h,22,,,222240000A0256,,,,,,,,,,,,,0,,,,,BF,futaies feuillues,,,8710,-3.513741,48.725382
2019-275221,2019-06-13,000001,Vente,800000,5094,,KERNINON,B311,22300,22224,Ploulec'h,22,,,222240000A0257,,,,,,,,,,,,,0,1,Maison,63,3,S,sols,,,55,-3.513641,48.72473
2019-275221,2019-06-13,000001,Vente,800000,,,GRAND JARDIN,B232,22300,22224,Ploulec'h,22,,,222240000A0258,,,,,,,,,,,,,0,,,,,J,jardins,,,7220,-3.514336,48.72498
2019-275221,2019-06-13,000001,Vente,800000,5093,,KERNINON,B311,22300,22224,Ploulec'h,22,,,222240000A0259,,,,,,,,,,,,,0,4,Local industriel. commercial ou assimilé,,0,S,sols,,,2110,-3.514733,48.724792
2019-275221,2019-06-13,000001,Vente,800000,,,CRECH AR FEUTEUN,B178,22300,22224,Ploulec'h,22,,,222240000A0260,,,,,,,,,,,,,0,,,,,BF,futaies feuillues,,,36450,-3.515792,48.725668
2019-275221,2019-06-13,000001,Vente,800000,,,NEJEO BIAN,B549,22300,22224,Ploulec'h,22,,,222240000A0261,,,,,,,,,,,,,0,,,,,T,terres,,,5100,-3.517605,48.725248
2019-275221,2019-06-13,000001,Vente,800000,,,MEZO BIAN,B535,22300,22224,Ploulec'h,22,,,222240000A0266,,,,,,,,,,,,,0,,,,,T,terres,,,8410,-3.513885,48.726577
2019-275221,2019-06-13,000001,Vente,800000,,,MEZO BIAN,B535,22300,22224,Ploulec'h,22,,,222240000A0267,,,,,,,,,,,,,0,,,,,T,terres,,,1980,-3.51433,48.726906
2019-275221,2019-06-13,000001,Vente,800000,,,NEJEO BRAS,B550,22300,22224,Ploulec'h,22,,,222240000A0891,,,,,,,,,,,,,0,,,,,T,terres,,,19246,-3.518012,48.726398
2019-275221,2019-06-13,000001,Vente,800000,,,LIORS KER NEO,B451,22300,22224,Ploulec'h,22,,,222240000A1187,,,,,,,,,,,,,0,,,,,T,terres,,,12995,-3.512823,48.727021
2019-275221,2019-06-13,000001,Vente,800000,,,PARC HAMON BRAS,B755,22300,22224,Ploulec'h,22,,,222240000A1189,,,,,,,,,,,,,0,,,,,T,terres,,,12240,-3.510065,48.725924
2019-275221,2019-06-13,000001,Vente,800000,,,PARC HAMON BRAS,B755,22300,22224,Ploulec'h,22,,,222240000A1190,,,,,,,,,,,,,0,,,,,T,terres,,,90,-3.509821,48.726403
2019-275221,2019-06-13,000001,Vente,800000,,,PARC GUILLOU,B750,22300,22224,Ploulec'h,22,,,222240000A1191,,,,,,,,,,,,,0,,,,,T,terres,,,6101,-3.509017,48.725946
2019-275221,2019-06-13,000001,Vente,800000,,,PARC GUILLON,B749,22300,22224,Ploulec'h,22,,,222240000A1193,,,,,,,,,,,,,0,,,,,T,terres,,,3492,-3.507934,48.725951
2019-275221,2019-06-13,000001,Vente,800000,,,COZ STANG,B177,22300,22224,Ploulec'h,22,,,222240000B0005,,,,,,,,,,,,,0,,,,,E,eaux,,,1160,-3.515584,48.724506
2019-275221,2019-06-13,000001,Vente,800000,,,AR HLOS,B057,22300,22224,Ploulec'h,22,,,222240000B0006,,,,,,,,,,,,,0,,,,,S,sols,,,640,-3.51482,48.724383
2019-275221,2019-06-13,000001,Vente,800000,,,AR HLOS,B057,22300,22224,Ploulec'h,22,,,222240000B0006,,,,,,,,,,,,,0,,,,,P,prés,,,5650,-3.51482,48.724383
2019-275221,2019-06-13,000001,Vente,800000,,,KERNINON,B311,22300,22224,Ploulec'h,22,,,222240000B0007,,,,,,,,,,,,,0,,,,,S,sols,,,350,-3.514799,48.724498
2019-275221,2019-06-13,000001,Vente,800000,,,PARC PORS KERNINON,B864,22300,22224,Ploulec'h,22,,,222240000B0009,,,,,,,,,,,,,0,,,,,S,sols,,,3680,-3.51229,48.724225
2019-275221,2019-06-13,000001,Vente,800000,,,PARC PORS KERNINON,B864,22300,22224,Ploulec'h,22,,,222240000B0009,,,,,,,,,,,,,0,,,,,T,terres,,,17720,-3.51229,48.724225
2019-275221,2019-06-13,000001,Vente,800000,,,KERNINON,B311,22300,22224,Ploulec'h,22,,,222240000B0851,,,,,,,,,,,,,0,,,,,BF,futaies feuillues,,,15332,-3.512298,48.724639
2019-275272,2019-06-04,000001,Vente,100000,6627,,BEL AIR,C232,22300,22224,Ploulec'h,22,,,222240000C1274,,,,,,,,,,,,,0,4,Local industriel. commercial ou assimilé,270,0,S,sols,,,287,-3.48432,48.71966
2019-275421,2019-06-18,000001,Vente,27410,5,,RUE DE PARCOMEUR,0098,22300,22224,Ploulec'h,22,,,222240000B1787,,,,,,,,,,,,,0,,,,,AB,terrains a bâtir,,,34,-3.499545,48.720377
2019-275421,2019-06-18,000001,Vente,27410,5,,RUE DE PARCOMEUR,0098,22300,22224,Ploulec'h,22,,,222240000B1788,,,,,,,,,,,,,0,,,,,AB,terrains a bâtir,,,56,-3.499428,48.720392
2019-275421,2019-06-18,000001,Vente,27410,5,,RUE DE PARCOMEUR,0098,22300,22224,Ploulec'h,22,,,222240000B1825,,,,,,,,,,,,,0,,,,,AB,terrains a bâtir,,,353,-3.499491,48.720496
2019-275510,2019-07-01,000001,Vente,95000,9,A,IMP RUBOEN,1260,22300,22224,Ploulec'h,22,,,222240000A1286,,,,,,,,,,,,,0,1,Maison,61,3,S,sols,,,257,-3.500301,48.731792
2019-275557,2019-07-23,000001,Vente,300000,,,PARC TAHOM,B905,22300,22224,Ploulec'h,22,,,222240000C0363,,,,,,,,,,,,,0,,,,,BT,taillis simples,,,6625,-3.493371,48.715655
2019-275557,2019-07-23,000001,Vente,300000,5,,RTE DE MORLAIX,0094,22300,22224,Ploulec'h,22,,,222240000C1069,,,,,,,,,,,,,0,4,Local industriel. commercial ou assimilé,439,0,S,sols,,,2000,-3.494206,48.714901
2019-275557,2019-07-23,000001,Vente,300000,5,,RTE DE MORLAIX,0094,22300,22224,Ploulec'h,22,,,222240000C1069,,,,,,,,,,,,,0,4,Local industriel. commercial ou assimilé,439,0,T,terres,,,1000,-3.494206,48.714901
2019-275557,2019-07-23,000001,Vente,300000,,,PARC AR GROAS,B625,22300,22224,Ploulec'h,22,,,222240000C1227,,,,,,,,,,,,,0,,,,,AB,terrains a bâtir,,,1788,-3.493798,48.714381
2019-275718,2019-07-24,000001,Vente,31740,8,,RUE DE PARCOMEUR,0098,22300,22224,Ploulec'h,22,,,222240000B1782,,,,,,,,,,,,,0,,,,,AB,terrains a bâtir,,,512,-3.499675,48.720174
2019-275723,2019-07-24,000001,Vente,44000,28,,RUE DU STADE,0188,22300,22224,Ploulec'h,22,,,222240000B1802,,,,,,,,,,,,,0,,,,,AB,terrains a bâtir,,,710,-3.49905,48.721243
2019-275770,2019-08-09,000001,Vente,33170,10,,RUE DE PARCOMEUR,0098,22300,22224,Ploulec'h,22,,,222240000B1783,,,,,,,,,,,,,0,,,,,AB,terrains a bâtir,,,257,-3.49946,48.72017
2019-275770,2019-08-09,000001,Vente,33170,10,,RUE DE PARCOMEUR,0098,22300,22224,Ploulec'h,22,,,222240000B1790,,,,,,,,,,,,,0,,,,,AB,terrains a bâtir,,,278,-3.499358,48.720159
2019-275947,2019-08-20,000001,Vente,110000,,,LIORS AR LEUR,B408,22300,22224,Ploulec'h,22,,,222240000C0130,,,,,,,,,,,,,0,,,,,T,terres,,,1365,-3.500349,48.710959
2019-275947,2019-08-20,000001,Vente,110000,15,,RTE DE MORLAIX,0094,22300,22224,Ploulec'h,22,,,222240000C1002,,,,,,,,,,,,,0,1,Maison,102,4,S,sols,,,756,-3.500259,48.711173
2019-275947,2019-08-20,000001,Vente,110000,,,KERISSY SCOUARNEGUES,B287,22300,22224,Ploulec'h,22,,,222240000C1003,,,,,,,,,,,,,0,,,,,S,sols,,,54,-3.500264,48.711058
2019-276028,2019-09-03,000001,Vente,2800,,,PARC KER JEZEQUEL,B778,22300,22224,Ploulec'h,22,,,222240000B0302,,,,,,,,,,,,,0,,,,,T,terres,,,2060,-3.51296,48.711727
2019-276028,2019-09-03,000001,Vente,2800,,,PARC KER JEZEQUEL,B778,22300,22224,Ploulec'h,22,,,222240000B0303,,,,,,,,,,,,,0,,,,,P,prés,,,2080,-3.512441,48.712056
2019-276260,2019-09-24,000001,Vente,175000,10,,RTE DE CROAS MIN,0046,22300,22224,Ploulec'h,22,,,222240000A0908,,,,,,,,,,,,,0,1,Maison,100,4,S,sols,,,800,-3.512386,48.728013
2019-276260,2019-09-24,000001,Vente,175000,10,,RTE DE CROAS MIN,0046,22300,22224,Ploulec'h,22,,,222240000A0908,,,,,,,,,,,,,0,1,Maison,100,4,J,jardins,,,3651,-3.512386,48.728013
2019-276341,2019-10-18,000001,Vente,228000,1,,RTE DE KERANGLAS,0070,22300,22224,Ploulec'h,22,,,222240000B1170,,,,,,,,,,,,,0,1,Maison,105,5,S,sols,,,554,-3.505793,48.719318
2019-276341,2019-10-18,000001,Vente,228000,1,,RTE DE KERANGLAS,0070,22300,22224,Ploulec'h,22,,,222240000B1170,,,,,,,,,,,,,0,1,Maison,105,5,J,jardins,,,700,-3.505793,48.719318
2019-276342,2019-10-25,000002,Vente,,,,PARC PESSAN,B852,22300,22224,Ploulec'h,22,,,222240000B1832,,,,,,,,,,,,,0,,,,,S,sols,,,108,-3.498252,48.719043
2019-276475,2019-10-23,000001,Vente,40860,20,,RUE DE PARCOMEUR,0098,22300,22224,Ploulec'h,22,,,222240000B1811,,,,,,,,,,,,,0,,,,,AB,terrains a bâtir,,,659,-3.498701,48.72079
2019-276536,2019-11-25,000001,Vente,213000,12,,RTE DE ST LAVAN,0208,22300,22224,Ploulec'h,22,,,222240000A1209,,,,,,,,,,,,,0,1,Maison,106,4,J,jardins,,,1000,-3.497388,48.728661
2019-276536,2019-11-25,000001,Vente,213000,12,,RTE DE ST LAVAN,0208,22300,22224,Ploulec'h,22,,,222240000A1209,,,,,,,,,,,,,0,1,Maison,106,4,T,terres,,,2000,-3.497388,48.728661
2019-276536,2019-11-25,000001,Vente,213000,12,,RTE DE ST LAVAN,0208,22300,22224,Ploulec'h,22,,,222240000A1209,,,,,,,,,,,,,0,1,Maison,106,4,S,sols,,,815,-3.497388,48.728661
2019-276582,2019-11-09,000002,Vente,36000,,,LIORS AR HIVIC,B404,22300,22224,Ploulec'h,22,,,222240000B1833,,,,,,,,,,,,,0,,,,,T,terres,,,1880,-3.505234,48.71904
2019-276589,2019-11-15,000001,Vente,100000,,,MEZ VERET HUELLAN,B531,22300,22224,Ploulec'h,22,,,222240000C0078,,,,,,,,,,,,,0,,,,,T,terres,,,1790,-3.50363,48.703289
2019-276589,2019-11-15,000001,Vente,100000,5,,RTE DE PONTOL,0138,22300,22224,Ploulec'h,22,,,222240000C0112,,,,,,,,,,,,,0,1,Maison,139,4,S,sols,,,466,-3.504737,48.706621
2019-276653,2019-11-26,000001,Vente,200250,4,,IMP DE POUL VRAZ,0154,22300,22224,Ploulec'h,22,,,222240000A0675,,,,,,,,,,,,,0,1,Maison,90,4,S,sols,,,580,-3.530479,48.729385
2019-276714,2019-12-10,000001,Vente,31900,14,,RUE DE PARCOMEUR,0098,22300,22224,Ploulec'h,22,,,222240000B1796,,,,,,,,,,,,,0,,,,,AB,terrains a bâtir,,,514,-3.498984,48.720207
2019-277019,2019-12-31,000001,Vente,19573,,,LANNEC MIN RAN,B358,22300,22224,Ploulec'h,22,,,222240000C0734,,,,,,,,,,,,,0,,,,,BT,taillis simples,,,3210,-3.464069,48.71792
2019-277019,2019-12-31,000001,Vente,19573,,,AR HOAT,B061,22300,22224,Ploulec'h,22,,,222240000C0736,,,,,,,,,,,,,0,,,,,BT,taillis simples,,,1790,-3.464827,48.718211
2019-277019,2019-12-31,000001,Vente,19573,,,PRAT OLLU,C078,22300,22224,Ploulec'h,22,,,222240000C0765,,,,,,,,,,,,,0,,,,,BT,taillis simples,,,5375,-3.463026,48.716991
2019-277019,2019-12-31,000001,Vente,19573,,,COAT MIN RAN,B136,22300,22224,Ploulec'h,22,,,222240000C0766,,,,,,,,,,,,,0,,,,,BF,futaies feuillues,,,2280,-3.462772,48.717413
2019-277019,2019-12-31,000001,Vente,19573,,,PRAT MIN RAN,C071,22300,22224,Ploulec'h,22,,,222240000C1007,,,,,,,,,,,,,0,,,,,BT,taillis simples,,,6918,-3.4637,48.718211
2019-277052,2019-12-31,000001,Vente,215000,,,PARC MEUR BIAN,B821,22300,22224,Ploulec'h,22,,,222240000B0558,,,,,,,,,,,,,0,,,,,S,sols,,,185,-3.498311,48.71316
2019-277052,2019-12-31,000001,Vente,215000,10,,RTE DE MORLAIX,0094,22300,22224,Ploulec'h,22,,,222240000B0796,,,,,,,,,,,,,0,4,Local industriel. commercial ou assimilé,,,S,sols,,,1385,-3.498438,48.713305
2019-277052,2019-12-31,000001,Vente,215000,10,,RTE DE MORLAIX,0094,22300,22224,Ploulec'h,22,,,222240000B1691,,,,,,,,,,,,,0,,,,,S,sols,,,796,-3.498324,48.713477
2019-277052,2019-12-31,000001,Vente,215000,,,AR HLOS,B057,22300,22224,Ploulec'h,22,,,222240000B1692,,,,,,,,,,,,,0,,,,,S,sols,,,239,-3.498738,48.71361
