id_mutation,date_mutation,numero_disposition,nature_mutation,valeur_fonciere,adresse_numero,adresse_suffixe,adresse_nom_voie,adresse_code_voie,code_postal,code_commune,nom_commune,code_departement,ancien_code_commune,ancien_nom_commune,id_parcelle,ancien_id_parcelle,numero_volume,lot1_numero,lot1_surface_carrez,lot2_numero,lot2_surface_carrez,lot3_numero,lot3_surface_carrez,lot4_numero,lot4_surface_carrez,lot5_numero,lot5_surface_carrez,nombre_lots,code_type_local,type_local,surface_reelle_bati,nombre_pieces_principales,code_nature_culture,nature_culture,code_nature_culture_speciale,nature_culture_speciale,surface_terrain,longitude,latitude
2019-279129,2019-03-04,000001,Vente,14000,,,LES VARENNES,B028,23270,23188,Saint-Dizier-les-Domaines,23,,,231880000B0926,,,,,,,,,,,,,0,,,,,T,terres,,,597,2.041377,46.326139
2019-279129,2019-03-04,000001,Vente,14000,,,LES VARENNES,B028,23270,23188,Saint-Dizier-les-Domaines,23,,,231880000B0927,,,,,,,,,,,,,0,,,,,P,prés,,,1492,2.040984,46.32624
2019-279129,2019-03-04,000001,Vente,14000,,,LES VARENNES,B028,23270,23188,Saint-Dizier-les-Domaines,23,,,231880000B0928,,,,,,,,,,,,,0,,,,,P,prés,,,1491,2.041486,46.326508
2019-279129,2019-03-04,000001,Vente,14000,5054,,LES VARENNES,B028,23270,23188,Saint-Dizier-les-Domaines,23,,,231880000B0929,,,,,,,,,,,,,0,3,Dépendance,,0,S,sols,,,366,2.041033,46.326696
2019-279129,2019-03-04,000001,Vente,14000,5055,,LES VARENNES,B028,23270,23188,Saint-Dizier-les-Domaines,23,,,231880000B0930,,,,,,,,,,,,,0,1,Maison,43,1,S,sols,,,1150,2.040788,46.326658
2019-279129,2019-03-04,000001,Vente,14000,,,LES VARENNES,B028,23270,23188,Saint-Dizier-les-Domaines,23,,,231880000B0931,,,,,,,,,,,,,0,,,,,J,jardins,,,740,2.040597,46.326412
2019-279129,2019-03-04,000001,Vente,14000,,,LES VARENNES,B028,23270,23188,Saint-Dizier-les-Domaines,23,,,231880000B0932,,,,,,,,,,,,,0,,,,,T,terres,,,2235,2.040264,46.326692
2019-279257,2019-02-22,000001,Vente,28000,,,LE BOURG,B005,23270,23188,Saint-Dizier-les-Domaines,23,,,231880000B0839,,,,,,,,,,,,,0,,,,,T,terres,,,3830,2.040023,46.317013
2019-279257,2019-02-22,000001,Vente,28000,5192,,LE BOURG,B005,23270,23188,Saint-Dizier-les-Domaines,23,,,231880000B0862,,,,,,,,,,,,,0,1,Maison,60,3,S,sols,,,233,2.037555,46.318296
2019-279689,2019-04-04,000001,Vente,60000,5128,,PUY MAURY,B025,23270,23188,Saint-Dizier-les-Domaines,23,,,231880000B0149,,,,,,,,,,,,,0,1,Maison,145,7,S,sols,,,836,2.067573,46.327227
2019-279689,2019-04-04,000001,Vente,60000,,,PUY MAURY,B025,23270,23188,Saint-Dizier-les-Domaines,23,,,231880000B0169,,,,,,,,,,,,,0,,,,,S,sols,,,100,2.067207,46.327475
2019-279689,2019-04-04,000001,Vente,60000,,,PUY MAURY,B025,23270,23188,Saint-Dizier-les-Domaines,23,,,231880000B0169,,,,,,,,,,,,,0,,,,,P,prés,,,2962,2.067207,46.327475
2019-279689,2019-04-04,000001,Vente,60000,,,LA VERRIERE,B033,23270,23188,Saint-Dizier-les-Domaines,23,,,231880000B0233,,,,,,,,,,,,,0,,,,,BT,taillis simples,,,1886,2.069042,46.325394
2019-279910,2019-04-18,000001,Vente,40000,,,LES BOISSIERES,B003,23270,23188,Saint-Dizier-les-Domaines,23,,,231880000B0276,,,,,,,,,,,,,0,,,,,T,terres,,,979,2.063203,46.335916
2019-279910,2019-04-18,000001,Vente,40000,,,LES BOISSIERES,B003,23270,23188,Saint-Dizier-les-Domaines,23,,,231880000B0277,,,,,,,,,,,,,0,,,,,S,sols,,,575,2.063012,46.335947
2019-279910,2019-04-18,000001,Vente,40000,5140,,LES BOISSIERES,B003,23270,23188,Saint-Dizier-les-Domaines,23,,,231880000B0278,,,,,,,,,,,,,0,1,Maison,129,6,S,sols,,,551,2.062854,46.335781
2019-279910,2019-04-18,000001,Vente,40000,,,LES BOISSIERES,B003,23270,23188,Saint-Dizier-les-Domaines,23,,,231880000B0279,,,,,,,,,,,,,0,,,,,S,sols,,,587,2.062725,46.335652
2019-280091,2019-05-28,000001,Vente,19000,5013,,LES PINOTS,B022,23270,23188,Saint-Dizier-les-Domaines,23,,,231880000A0283,,,,,,,,,,,,,0,1,Maison,49,2,S,sols,,,1975,2.039087,46.327422
2019-280091,2019-05-28,000001,Vente,19000,,,LES PINOTS,B022,23270,23188,Saint-Dizier-les-Domaines,23,,,231880000A0743,,,,,,,,,,,,,0,,,,,P,prés,,,5519,2.038952,46.327047
2019-280296,2019-06-07,000001,Vente,622,,,LA VERRIERE,B033,23270,23188,Saint-Dizier-les-Domaines,23,,,231880000C0422,,,,,,,,,,,,,0,,,,,T,terres,,,3110,2.068307,46.321401
2019-280297,2019-06-07,000001,Vente,7479,,,PUY MAURY,B025,23270,23188,Saint-Dizier-les-Domaines,23,,,231880000B0195,,,,,,,,,,,,,0,,,,,P,prés,,,3580,2.061732,46.326133
2019-280297,2019-06-07,000001,Vente,7479,,,LA VERRIERE,B033,23270,23188,Saint-Dizier-les-Domaines,23,,,231880000B0248,,,,,,,,,,,,,0,,,,,P,prés,,,11262,2.062218,46.324523
2019-280297,2019-06-07,000001,Vente,7479,,,LA VERRIERE,B033,23270,23188,Saint-Dizier-les-Domaines,23,,,231880000B0264,,,,,,,,,,,,,0,,,,,T,terres,,,5682,2.06209,46.323033
2019-280297,2019-06-07,000001,Vente,7479,,,LA VERRIERE,B033,23270,23188,Saint-Dizier-les-Domaines,23,,,231880000B0265,,,,,,,,,,,,,0,,,,,P,prés,,,4260,2.061405,46.323046
2019-280297,2019-06-07,000001,Vente,7479,,,LA VERRIERE,B033,23270,23188,Saint-Dizier-les-Domaines,23,,,231880000B0266,,,,,,,,,,,,,0,,,,,T,terres,,,5155,2.061823,46.322018
2019-280297,2019-06-07,000001,Vente,7479,,,LA VERRIERE,B033,23270,23188,Saint-Dizier-les-Domaines,23,,,231880000B0267,,,,,,,,,,,,,0,,,,,P,prés,,,3500,2.06123,46.322261
2019-280297,2019-06-07,000001,Vente,7479,,,LA VERRIERE,B033,23270,23188,Saint-Dizier-les-Domaines,23,,,231880000B1164,,,,,,,,,,,,,0,,,,,P,prés,,,3956,2.062324,46.323874
2019-280547,2019-06-17,000001,Vente,127500,,,LES BOISSIERES,B003,23270,23188,Saint-Dizier-les-Domaines,23,,,231880000B0294,,,,,,,,,,,,,0,,,,,S,sols,,,329,2.061514,46.33576
2019-280547,2019-06-17,000001,Vente,127500,,,LES BOISSIERES,B003,23270,23188,Saint-Dizier-les-Domaines,23,,,231880000B0295,,,,,,,,,,,,,0,,,,,J,jardins,,,343,2.061501,46.335621
2019-280547,2019-06-17,000001,Vente,127500,5150,,LES BOISSIERES,B003,23270,23188,Saint-Dizier-les-Domaines,23,,,231880000B0296,,,,,,,,,,,,,0,1,Maison,122,5,S,sols,,,312,2.06135,46.335479
2019-280547,2019-06-17,000001,Vente,127500,,,LES BOISSIERES,B003,23270,23188,Saint-Dizier-les-Domaines,23,,,231880000B0297,,,,,,,,,,,,,0,,,,,L,landes,,,169,2.061226,46.335313
2019-280547,2019-06-17,000001,Vente,127500,,,LES BOISSIERES,B003,23270,23188,Saint-Dizier-les-Domaines,23,,,231880000B0454,,,,,,,,,,,,,0,,,,,BT,taillis simples,,,4720,2.055779,46.331299
2019-280760,2019-07-22,000001,Vente,55000,5177,,LE BOURG,B005,23270,23188,Saint-Dizier-les-Domaines,23,,,231880000B0740,,,,,,,,,,,,,0,1,Maison,155,5,S,sols,,,250,2.034944,46.318923
2019-280760,2019-07-22,000001,Vente,55000,,,LE BOURG,B005,23270,23188,Saint-Dizier-les-Domaines,23,,,231880000B1093,,,,,,,,,,,,,0,,,,,S,sols,,,183,2.034876,46.318972
2019-280974,2019-08-21,000001,Vente,8416.46,,,CHEZ PENDU,B010,23270,23188,Saint-Dizier-les-Domaines,23,,,231880000B0513,,,,,,,,,,,,,0,,,,,T,terres,,,7616,2.057336,46.32391
2019-280974,2019-08-21,000001,Vente,8416.46,,,CHEZ PENDU,B010,23270,23188,Saint-Dizier-les-Domaines,23,,,231880000B0514,,,,,,,,,,,,,0,,,,,T,terres,,,6248,2.057195,46.323263
2019-280974,2019-08-21,000001,Vente,8416.46,,,CHEZ PENDU,B010,23270,23188,Saint-Dizier-les-Domaines,23,,,231880000B0517,,,,,,,,,,,,,0,,,,,T,terres,,,8622,2.058874,46.323046
2019-280974,2019-08-21,000001,Vente,8416.46,,,CHEZ PENDU,B010,23270,23188,Saint-Dizier-les-Domaines,23,,,231880000B0536,,,,,,,,,,,,,0,,,,,T,terres,,,9885,2.057652,46.322478
2019-281106,2019-08-21,000001,Vente,90000,,,LA JARGE,B017,23270,23188,Saint-Dizier-les-Domaines,23,,,231880000B0675,,,,,,,,,,,,,0,,,,,S,sols,,,500,2.046698,46.323818
2019-281106,2019-08-21,000001,Vente,90000,,,LA JARGE,B017,23270,23188,Saint-Dizier-les-Domaines,23,,,231880000B0675,,,,,,,,,,,,,0,,,,,P,prés,,,4850,2.046698,46.323818
2019-281106,2019-08-21,000001,Vente,90000,5065,,LA JARGE,B017,23270,23188,Saint-Dizier-les-Domaines,23,,,231880000B0676,,,,,,,,,,,,,0,1,Maison,76,7,S,sols,,,620,2.046439,46.323502
2019-281267,2019-09-20,000001,Vente,30750,5149,,LES BOISSIERES,B003,23270,23188,Saint-Dizier-les-Domaines,23,,,231880000B0298,,,,,,,,,,,,,0,1,Maison,56,2,S,sols,,,341,2.061156,46.335147
2019-281267,2019-09-20,000001,Vente,30750,,,LES BOISSIERES,B003,23270,23188,Saint-Dizier-les-Domaines,23,,,231880000B1183,,,,,,,,,,,,,0,,,,,S,sols,,,164,2.061057,46.335034
2019-281605,2019-10-01,000001,Vente,40000,,,MANDREDEIX,B019,23270,23188,Saint-Dizier-les-Domaines,23,,,231880000A0569,,,,,,,,,,,,,0,,,,,P,prés,,,364,2.013936,46.318194
2019-281605,2019-10-01,000001,Vente,40000,,,MANDREDEIX,B019,23270,23188,Saint-Dizier-les-Domaines,23,,,231880000A0697,,,,,,,,,,,,,0,,,,,J,jardins,,,183,2.014286,46.31921
2019-281605,2019-10-01,000001,Vente,40000,,,MANDREDEIX,B019,23270,23188,Saint-Dizier-les-Domaines,23,,,231880000A0698,,,,,,,,,,,,,0,,,,,P,prés,,,3277,2.014069,46.31877
2019-281605,2019-10-01,000001,Vente,40000,,,MANDREDEIX,B019,23270,23188,Saint-Dizier-les-Domaines,23,,,231880000A0698,,,,,,,,,,,,,0,,,,,S,sols,,,103,2.014069,46.31877
2019-281605,2019-10-01,000001,Vente,40000,,,MANDREDEIX,B019,23270,23188,Saint-Dizier-les-Domaines,23,,,231880000A0699,,,,,,,,,,,,,0,,,,,S,sols,,,135,2.014367,46.319113
2019-281605,2019-10-01,000001,Vente,40000,5043,,MANDREDEIX,B019,23270,23188,Saint-Dizier-les-Domaines,23,,,231880000A0700,,,,,,,,,,,,,0,1,Maison,47,3,S,sols,,,113,2.014318,46.319084
2019-281605,2019-10-01,000001,Vente,40000,,,MANDREDEIX,B019,23270,23188,Saint-Dizier-les-Domaines,23,,,231880000A0701,,,,,,,,,,,,,0,,,,,S,sols,,,252,2.014489,46.319032
