id_mutation,date_mutation,numero_disposition,nature_mutation,valeur_fonciere,adresse_numero,adresse_suffixe,adresse_nom_voie,adresse_code_voie,code_postal,code_commune,nom_commune,code_departement,ancien_code_commune,ancien_nom_commune,id_parcelle,ancien_id_parcelle,numero_volume,lot1_numero,lot1_surface_carrez,lot2_numero,lot2_surface_carrez,lot3_numero,lot3_surface_carrez,lot4_numero,lot4_surface_carrez,lot5_numero,lot5_surface_carrez,nombre_lots,code_type_local,type_local,surface_reelle_bati,nombre_pieces_principales,code_nature_culture,nature_culture,code_nature_culture_speciale,nature_culture_speciale,surface_terrain,longitude,latitude
2019-279691,2019-04-15,000001,Vente,800,,,PUY DES NOUHAUDS,B140,23400,23205,Saint-Junien-la-Bregère,23,,,23205000AM0182,,,,,,,,,,,,,0,,,,,BT,taillis simples,,,8680,1.751988,45.873321
2019-279897,2019-05-10,000001,Vente,12000,11,,VIGE,B175,23400,23205,Saint-Junien-la-Bregère,23,,,23205000BC0034,,,,,,,,,,,,,0,1,Maison,71,4,S,sols,,,277,1.711987,45.886012
2019-279897,2019-05-10,000001,Vente,12000,,,VIGE,B175,23400,23205,Saint-Junien-la-Bregère,23,,,23205000BC0035,,,,,,,,,,,,,0,,,,,T,terres,,,370,1.712201,45.886215
2019-279897,2019-05-10,000001,Vente,12000,,,LA CROIX,B049,23400,23205,Saint-Junien-la-Bregère,23,,,23205000BE0094,,,,,,,,,,,,,0,,,,,T,terres,,,3060,1.717421,45.887322
2019-280184,2019-05-29,000001,Vente,90000,,,LES COTES,B046,23400,23205,Saint-Junien-la-Bregère,23,,,23205000AZ0061,,,,,,,,,,,,,0,,,,,P,prés,,,2620,1.713339,45.881493
2019-280184,2019-05-29,000001,Vente,90000,,,LES COTES,B046,23400,23205,Saint-Junien-la-Bregère,23,,,23205000AZ0062,,,,,,,,,,,,,0,,,,,PA,pâtures,,,825,1.713766,45.882316
2019-280184,2019-05-29,000001,Vente,90000,,,LES COTES,B046,23400,23205,Saint-Junien-la-Bregère,23,,,23205000AZ0064,,,,,,,,,,,,,0,,,,,P,prés,,,4325,1.713664,45.881568
2019-280184,2019-05-29,000001,Vente,90000,,,VIGE,B175,23400,23205,Saint-Junien-la-Bregère,23,,,23205000BC0067,,,,,,,,,,,,,0,,,,,T,terres,,,770,1.712908,45.884969
2019-280184,2019-05-29,000001,Vente,90000,,,VIGE,B175,23400,23205,Saint-Junien-la-Bregère,23,,,23205000BC0086,,,,,,,,,,,,,0,,,,,S,sols,,,114,1.712976,45.88537
2019-280184,2019-05-29,000001,Vente,90000,4,,VIGE,B175,23400,23205,Saint-Junien-la-Bregère,23,,,23205000BC0087,,,,,,,,,,,,,0,1,Maison,104,4,S,sols,,,54,1.713061,45.885335
2019-280184,2019-05-29,000001,Vente,90000,,,VIGE,B175,23400,23205,Saint-Junien-la-Bregère,23,,,23205000BC0088,,,,,,,,,,,,,0,,,,,S,sols,,,746,1.713056,45.885212
2019-280184,2019-05-29,000001,Vente,90000,,,VIGE,B175,23400,23205,Saint-Junien-la-Bregère,23,,,23205000BC0092,,,,,,,,,,,,,0,,,,,T,terres,,,56,1.713314,45.885328
2019-280184,2019-05-29,000001,Vente,90000,,,LES COUTURES,B048,23400,23205,Saint-Junien-la-Bregère,23,,,23205000BC0097,,,,,,,,,,,,,0,,,,,PA,pâtures,,,2600,1.713849,45.882864
2019-280184,2019-05-29,000001,Vente,90000,,,LES TAILLAS,B165,23400,23205,Saint-Junien-la-Bregère,23,,,23205000BE0004,,,,,,,,,,,,,0,,,,,BT,taillis simples,,,3662,1.711251,45.892256
2019-280184,2019-05-29,000001,Vente,90000,,,LES TAILLAS,B165,23400,23205,Saint-Junien-la-Bregère,23,,,23205000BE0016,,,,,,,,,,,,,0,,,,,BT,taillis simples,,,3410,1.712482,45.893727
2019-280184,2019-05-29,000001,Vente,90000,,,BOIS DE LA SAGNE,B007,23400,23205,Saint-Junien-la-Bregère,23,,,23205000BE0150,,,,,,,,,,,,,0,,,,,T,terres,,,4247,1.714431,45.887529
2019-280184,2019-05-29,000001,Vente,90000,,,BOIS DE LA SAGNE,B007,23400,23205,Saint-Junien-la-Bregère,23,,,23205000BE0163,,,,,,,,,,,,,0,,,,,BT,taillis simples,,,3326,1.712131,45.889868
2019-280736,2019-06-27,000002,Vente,,,,LES PATURAUX,B103,23400,23205,Saint-Junien-la-Bregère,23,,,23205000AO0321,,,,,,,,,,,,,0,,,,,BR,futaies résineuses,,,156,1.772925,45.875864
2019-280736,2019-06-27,000003,Vente,,,,PUY REDON,B152,23400,23205,Saint-Junien-la-Bregère,23,,,23205000AO0314,,,,,,,,,,,,,0,,,,,BR,futaies résineuses,,,1252,1.772235,45.876329
2019-280736,2019-06-27,000003,Vente,,,,PUY REDON,B152,23400,23205,Saint-Junien-la-Bregère,23,,,23205000AO0315,,,,,,,,,,,,,0,,,,,BR,futaies résineuses,,,144,1.772137,45.876459
2019-280736,2019-06-27,000003,Vente,,,,PUY REDON,B152,23400,23205,Saint-Junien-la-Bregère,23,,,23205000AO0318,,,,,,,,,,,,,0,,,,,BR,futaies résineuses,,,1263,1.772468,45.87606
2019-281315,2019-09-02,000001,Vente,84000,5172,,RUE DU CHEVALIER DE CHATEAUNEU,0003,23400,23205,Saint-Junien-la-Bregère,23,,,23205000AN0113,,,,,,,,,,,,,0,1,Maison,94,4,S,sols,,,1122,1.753078,45.883099
2019-281336,2019-09-04,000001,Vente,55000,1,,VIGE,B175,23400,23205,Saint-Junien-la-Bregère,23,,,23205000BC0267,,,,,,,,,,,,,0,1,Maison,80,3,S,sols,,,500,1.713767,45.88622
2019-281336,2019-09-04,000001,Vente,55000,1,,VIGE,B175,23400,23205,Saint-Junien-la-Bregère,23,,,23205000BC0267,,,,,,,,,,,,,0,1,Maison,80,3,T,terres,,,1315,1.713767,45.88622
