id_mutation,date_mutation,numero_disposition,nature_mutation,valeur_fonciere,adresse_numero,adresse_suffixe,adresse_nom_voie,adresse_code_voie,code_postal,code_commune,nom_commune,code_departement,ancien_code_commune,ancien_nom_commune,id_parcelle,ancien_id_parcelle,numero_volume,lot1_numero,lot1_surface_carrez,lot2_numero,lot2_surface_carrez,lot3_numero,lot3_surface_carrez,lot4_numero,lot4_surface_carrez,lot5_numero,lot5_surface_carrez,nombre_lots,code_type_local,type_local,surface_reelle_bati,nombre_pieces_principales,code_nature_culture,nature_culture,code_nature_culture_speciale,nature_culture_speciale,surface_terrain,longitude,latitude
2019-289572,2019-07-18,000001,Vente,270000,,,ENTRAYGUES,B007,24560,24024,Bardou,24,,,240240000B0309,,,,,,,,,,,,,0,,,,,T,terres,,,2360,0.686769,44.732379
2019-289572,2019-07-18,000001,Vente,270000,,,ENTRAYGUES,B007,24560,24024,Bardou,24,,,240240000B0310,,,,,,,,,,,,,0,,,,,T,terres,,,1880,0.686644,44.732879
2019-289572,2019-07-18,000001,Vente,270000,1,,ENTRAYGUES,B007,24560,24024,Bardou,24,,,240240000B0311,,,,,,,,,,,,,0,4,Local industriel. commercial ou assimilé,37,0,S,sols,,,585,0.686664,44.733206
2019-289572,2019-07-18,000001,Vente,270000,13,,ENTRAYGUES,B007,24560,24024,Bardou,24,,,240240000B0312,,,,,,,,,,,,,0,1,Maison,243,5,S,sols,,,1545,0.686238,44.732998
2019-290286,2019-10-18,000001,Vente,250000,18,,PETITS CHAMPS,B009,24560,24024,Bardou,24,,,240240000A0311,,,,,,,,,,,,,0,1,Maison,100,5,S,sols,,,610,0.684067,44.738056
2019-290286,2019-10-18,000001,Vente,250000,,,PETITS CHAMPS,B009,24560,24024,Bardou,24,,,240240000A0315,,,,,,,,,,,,,0,,,,,T,terres,,,320,0.684695,44.73866
2019-290286,2019-10-18,000001,Vente,250000,,,PETITS CHAMPS,B009,24560,24024,Bardou,24,,,240240000A0316,,,,,,,,,,,,,0,,,,,P,prés,,,440,0.685048,44.738881
2019-290286,2019-10-18,000001,Vente,250000,,,PETITS CHAMPS,B009,24560,24024,Bardou,24,,,240240000A0430,,,,,,,,,,,,,0,,,,,J,jardins,,,945,0.684015,44.738291
2019-290286,2019-10-18,000001,Vente,250000,,,PETITS CHAMPS,B009,24560,24024,Bardou,24,,,240240000A0441,,,,,,,,,,,,,0,,,,,P,prés,,,123,0.684323,44.738198
2019-290286,2019-10-18,000001,Vente,250000,,,PETITS CHAMPS,B009,24560,24024,Bardou,24,,,240240000A0446,,,,,,,,,,,,,0,,,,,T,terres,,,789,0.685481,44.7386
2019-290286,2019-10-18,000001,Vente,250000,,,PETITS CHAMPS,B009,24560,24024,Bardou,24,,,240240000A0479,,,,,,,,,,,,,0,,,,,P,prés,,,810,0.684906,44.738913
2019-290286,2019-10-18,000001,Vente,250000,,,PETITS CHAMPS,B009,24560,24024,Bardou,24,,,240240000A0481,,,,,,,,,,,,,0,,,,,P,prés,,,5017,0.68493,44.738669
2019-290286,2019-10-18,000001,Vente,250000,,,PETITS CHAMPS,B009,24560,24024,Bardou,24,,,240240000A0483,,,,,,,,,,,,,0,,,,,P,prés,,,215,0.685842,44.738757
2019-290324,2019-10-10,000001,Vente,482500,20,,LE BOURG BAS,B003,24560,24024,Bardou,24,,,240240000A0346,,,,,,,,,,,,,0,1,Maison,42,3,S,sols,,,990,0.683683,44.737834
2019-290324,2019-10-10,000001,Vente,482500,20,,LE BOURG BAS,B003,24560,24024,Bardou,24,,,240240000A0346,,,,,,,,,,,,,0,1,Maison,162,2,S,sols,,,990,0.683683,44.737834
2019-290324,2019-10-10,000001,Vente,482500,17,,LE BOURG BAS,B003,24560,24024,Bardou,24,,,240240000A0347,,,,,,,,,,,,,0,4,Local industriel. commercial ou assimilé,10,0,S,sols,,,1785,0.683762,44.737644
2019-290324,2019-10-10,000001,Vente,482500,17,,LE BOURG BAS,B003,24560,24024,Bardou,24,,,240240000A0347,,,,,,,,,,,,,0,1,Maison,200,3,S,sols,,,1785,0.683762,44.737644
2019-290324,2019-10-10,000001,Vente,482500,,,LE BOURG BAS,B003,24560,24024,Bardou,24,,,240240000A0349,,,,,,,,,,,,,0,,,,,T,terres,,,3040,0.682451,44.737166
2019-290324,2019-10-10,000001,Vente,482500,,,LE BOURG BAS,B003,24560,24024,Bardou,24,,,240240000A0400,,,,,,,,,,,,,0,,,,,T,terres,,,8513,0.683054,44.737653
