id_mutation,date_mutation,numero_disposition,nature_mutation,valeur_fonciere,adresse_numero,adresse_suffixe,adresse_nom_voie,adresse_code_voie,code_postal,code_commune,nom_commune,code_departement,ancien_code_commune,ancien_nom_commune,id_parcelle,ancien_id_parcelle,numero_volume,lot1_numero,lot1_surface_carrez,lot2_numero,lot2_surface_carrez,lot3_numero,lot3_surface_carrez,lot4_numero,lot4_surface_carrez,lot5_numero,lot5_surface_carrez,nombre_lots,code_type_local,type_local,surface_reelle_bati,nombre_pieces_principales,code_nature_culture,nature_culture,code_nature_culture_speciale,nature_culture_speciale,surface_terrain,longitude,latitude
2019-291131,2019-01-04,000001,Vente,900,,,LE PONTET,B053,24400,24032,Beauronne,24,,,24032000AH0122,,,,,,,,,,,,,0,,,,,P,prés,,,2380,0.380882,45.097531
2019-291131,2019-01-04,000001,Vente,900,,,LE PONTET,B053,24400,24032,Beauronne,24,,,24032000AH0123,,,,,,,,,,,,,0,,,,,BS,taillis sous futaie,,,4500,0.381011,45.097886
2019-291210,2019-01-31,000001,Vente,95000,116,A,LES CHAMPS,B013,24400,24032,Beauronne,24,,,24032000AK0684,,,,,,,,,,,,,0,4,Local industriel. commercial ou assimilé,2100,0,S,sols,,,5918,0.378539,45.079992
2019-291210,2019-01-31,000001,Vente,95000,,,LES CHAMPS,B013,24400,24032,Beauronne,24,,,24032000AK0685,,,,,,,,,,,,,0,,,,,S,sols,,,30,0.379667,45.08012
2019-291210,2019-01-31,000001,Vente,95000,,,LES CHAMPS,B013,24400,24032,Beauronne,24,,,24032000AK0717,,,,,,,,,,,,,0,,,,,S,sols,,,950,0.37903,45.079835
2019-291220,2019-02-11,000001,Vente,10750,,,BOISSONNIE NORD,B005,24400,24032,Beauronne,24,,,24032000AI0686,,,,,,,,,,,,,0,,,,,T,terres,,,911,0.380594,45.085298
2019-291220,2019-02-11,000001,Vente,10750,,,BOISSONNIE NORD,B005,24400,24032,Beauronne,24,,,24032000AI0687,,,,,,,,,,,,,0,,,,,T,terres,,,34,0.380788,45.085241
2019-291264,2019-02-20,000001,Vente,13250,,,LE MOULIN,B045,24400,24032,Beauronne,24,,,24032000AK0571,,,,,,,,,,,,,0,,,,,T,terres,,,3466,0.376576,45.075954
2019-291293,2019-02-28,000001,Vente,12000,,,LES LOUBEAUX SUD,B066,24400,24032,Beauronne,24,,,240320000X0007,,,,,,,,,,,,,0,,,,,T,terres,,,2260,0.350862,45.124106
2019-291293,2019-02-28,000001,Vente,12000,,,LES LOUBEAUX SUD,B066,24400,24032,Beauronne,24,,,240320000X0007,,,,,,,,,,,,,0,,,,,BM,futaies mixtes,,,13860,0.350862,45.124106
2019-291293,2019-02-28,000001,Vente,12000,,,LES LOUBEAUX SUD,B066,24400,24032,Beauronne,24,,,240320000X0007,,,,,,,,,,,,,0,,,,,P,prés,,,21340,0.350862,45.124106
2019-291293,2019-02-28,000001,Vente,12000,,,LES LOUBEAUX SUD,B066,24400,24032,Beauronne,24,,,240320000X0007,,,,,,,,,,,,,0,,,,,T,terres,,,21350,0.350862,45.124106
2019-291293,2019-02-28,000001,Vente,12000,,,LES LOUBEAUX SUD,B066,24400,24032,Beauronne,24,,,240320000X0007,,,,,,,,,,,,,0,,,,,T,terres,,,2280,0.350862,45.124106
2019-291293,2019-02-28,000001,Vente,12000,,,LES LOUBEAUX SUD,B066,24400,24032,Beauronne,24,,,240320000X0057,,,,,,,,,,,,,0,,,,,BM,futaies mixtes,,,5541,0.349297,45.12414
2019-291293,2019-02-28,000001,Vente,12000,,,LES LOUBEAUX SUD,B066,24400,24032,Beauronne,24,,,240320000X0057,,,,,,,,,,,,,0,,,,,P,prés,,,7966,0.349297,45.12414
2019-291611,2019-05-28,000001,Vente,55000,,,MAINE MOULIN,B039,24400,24032,Beauronne,24,,,24032000AE0185,,,,,,,,,,,,,0,,,,,S,sols,,,133,0.384728,45.106636
2019-291611,2019-05-28,000001,Vente,55000,28,,MAINE MOULIN,B039,24400,24032,Beauronne,24,,,24032000AE0186,,,,,,,,,,,,,0,1,Maison,117,4,S,sols,,,1330,0.384498,45.106794
2019-291611,2019-05-28,000001,Vente,55000,,,MAINE MOULIN,B039,24400,24032,Beauronne,24,,,24032000AE0538,,,,,,,,,,,,,0,,,,,S,sols,,,500,0.384047,45.106945
2019-291611,2019-05-28,000001,Vente,55000,,,MAINE MOULIN,B039,24400,24032,Beauronne,24,,,24032000AE0538,,,,,,,,,,,,,0,,,,,T,terres,,,677,0.384047,45.106945
2019-291611,2019-05-28,000001,Vente,55000,,,MAINE MOULIN,B039,24400,24032,Beauronne,24,,,24032000AE0540,,,,,,,,,,,,,0,,,,,T,terres,,,732,0.383451,45.106979
2019-291650,2019-06-07,000001,Vente,250,,,LE PONTET,B053,24400,24032,Beauronne,24,,,24032000AH0111,,,,,,,,,,,,,0,,,,,BM,futaies mixtes,,,778,0.379628,45.097942
2019-291650,2019-06-07,000001,Vente,250,,,LE PONTET,B053,24400,24032,Beauronne,24,,,24032000AH0111,,,,,,,,,,,,,0,,,,,B,bois,,,1165,0.379628,45.097942
2019-291980,2019-09-05,000001,Vente,20000,,,BOISSONNIE NORD,B005,24400,24032,Beauronne,24,,,24032000AI0187,,,,,,,,,,,,,0,,,,,T,terres,,,767,0.380545,45.085682
2019-291980,2019-09-05,000001,Vente,20000,,,BOISSONNIE NORD,B005,24400,24032,Beauronne,24,,,24032000AI0188,,,,,,,,,,,,,0,,,,,T,terres,,,1180,0.380519,45.08591
2019-292015,2019-09-03,000001,Vente,135000,152,,LA PETITE FAYE EST,B048,24400,24032,Beauronne,24,,,24032000AS0006,,,,,,,,,,,,,0,1,Maison,128,4,S,sols,,,684,0.354393,45.10331
2019-292015,2019-09-03,000001,Vente,135000,,,LA PETITE FAYE EST,B048,24400,24032,Beauronne,24,,,24032000AS0007,,,,,,,,,,,,,0,,,,,P,prés,,,7100,0.354023,45.103511
2019-292015,2019-09-03,000001,Vente,135000,,,LA PETITE FAYE EST,B048,24400,24032,Beauronne,24,,,24032000AS0300,,,,,,,,,,,,,0,,,,,T,terres,,,890,0.354081,45.103258
2019-292074,2019-09-23,000001,Vente,12500,,,BOISSONNIE NORD,B005,24400,24032,Beauronne,24,,,24032000AI0522,,,,,,,,,,,,,0,,,,,T,terres,,,875,0.380584,45.084904
2019-292074,2019-09-23,000001,Vente,12500,,,BOISSONNIE NORD,B005,24400,24032,Beauronne,24,,,24032000AI0650,,,,,,,,,,,,,0,,,,,T,terres,,,126,0.380592,45.085018
2019-292074,2019-09-23,000001,Vente,12500,,,BOISSONNIE NORD,B005,24400,24032,Beauronne,24,,,24032000AI0651,,,,,,,,,,,,,0,,,,,S,sols,,,262,0.380536,45.085036
2019-292149,2019-10-08,000001,Vente,30000,73,,LE BOURG,B010,24400,24032,Beauronne,24,,,24032000AH0236,,,,,,,,,,,,,0,1,Maison,102,3,S,sols,,,970,0.382142,45.095106
2019-292149,2019-10-08,000001,Vente,30000,,,LE BOURG,B010,24400,24032,Beauronne,24,,,24032000AH0237,,,,,,,,,,,,,0,,,,,J,jardins,,,88,0.382056,45.095227
2019-292301,2019-11-05,000001,Vente,174900,76,,LE BOURG,B010,24400,24032,Beauronne,24,,,24032000AH0233,,,,,,,,,,,,,0,1,Maison,200,8,S,sols,,,470,0.381845,45.094828
2019-292301,2019-11-05,000001,Vente,174900,,,LE BOURG,B010,24400,24032,Beauronne,24,,,24032000AH0238,,,,,,,,,,,,,0,,,,,J,jardins,,,1140,0.382065,45.095303
2019-292301,2019-11-05,000001,Vente,174900,,,LE BOURG,B010,24400,24032,Beauronne,24,,,24032000AH0239,,,,,,,,,,,,,0,,,,,S,sols,,,254,0.381811,45.095159
2019-292376,2019-11-16,000001,Vente,5000,,,LE MAS EST,B042,24400,24032,Beauronne,24,,,24032000AH0067,,,,,,,,,,,,,0,,,,,P,prés,,,2219,0.370438,45.102183
2019-292376,2019-11-16,000001,Vente,5000,,,LE MAS EST,B042,24400,24032,Beauronne,24,,,24032000AH0068,,,,,,,,,,,,,0,,,,,P,prés,,,1909,0.370513,45.101996
2019-292376,2019-11-16,000001,Vente,5000,,,LE MAS EST,B042,24400,24032,Beauronne,24,,,24032000AH0069,,,,,,,,,,,,,0,,,,,P,prés,,,1100,0.370425,45.101249
2019-292376,2019-11-16,000001,Vente,5000,,,LE MAS EST,B042,24400,24032,Beauronne,24,,,24032000AH0070,,,,,,,,,,,,,0,,,,,P,prés,,,4750,0.370728,45.101894
2019-292376,2019-11-16,000001,Vente,5000,,,LE MAS EST,B042,24400,24032,Beauronne,24,,,24032000AH0071,,,,,,,,,,,,,0,,,,,P,prés,,,3266,0.370912,45.101489
2019-292376,2019-11-16,000001,Vente,5000,,,LE MAS EST,B042,24400,24032,Beauronne,24,,,24032000AH0072,,,,,,,,,,,,,0,,,,,BT,taillis simples,,,59,0.370573,45.101077
2019-292488,2019-12-12,000001,Vente,120460,117,A,LES CHAMPS,B013,24400,24032,Beauronne,24,,,24032000AK0502,,,,,,,,,,,,,0,1,Maison,99,4,S,sols,,,2640,0.377188,45.08067
2019-292488,2019-12-12,000001,Vente,120460,117,A,LES CHAMPS,B013,24400,24032,Beauronne,24,,,24032000AK0502,,,,,,,,,,,,,0,1,Maison,99,4,BM,futaies mixtes,,,3800,0.377188,45.08067
2019-292488,2019-12-12,000001,Vente,120460,117,A,LES CHAMPS,B013,24400,24032,Beauronne,24,,,24032000AK0502,,,,,,,,,,,,,0,1,Maison,99,4,T,terres,,,3070,0.377188,45.08067
2019-292548,2019-12-28,000001,Vente,266666.66,,,LES GAUTHERIES,B027,24400,24032,Beauronne,24,,,24032000AD0507,,,,,,,,,,,,,0,,,,,BT,taillis simples,,,145,0.373597,45.116417
2019-292548,2019-12-28,000001,Vente,266666.66,,,LES GAUTHERIES,B027,24400,24032,Beauronne,24,,,24032000AD0513,,,,,,,,,,,,,0,,,,,BT,taillis simples,,,2388,0.374814,45.116904
2019-292548,2019-12-28,000001,Vente,266666.66,,,PLANEZE,B052,24400,24032,Beauronne,24,,,24032000AT0195,,,,,,,,,,,,,0,,,,,BR,futaies résineuses,,,664,0.36705,45.114372
2019-292548,2019-12-28,000001,Vente,266666.66,14,,COUTANCIAS,B017,24400,24032,Beauronne,24,,,240320000Y0075,,,,,,,,,,,,,0,1,Maison,120,3,,,,,,0.371485,45.119439
2019-292548,2019-12-28,000001,Vente,266666.66,14,,COUTANCIAS,B017,24400,24032,Beauronne,24,,,240320000Y0075,,,,,,,,,,,,,0,1,Maison,208,7,,,,,,0.371485,45.119439
