id_mutation,date_mutation,numero_disposition,nature_mutation,valeur_fonciere,adresse_numero,adresse_suffixe,adresse_nom_voie,adresse_code_voie,code_postal,code_commune,nom_commune,code_departement,ancien_code_commune,ancien_nom_commune,id_parcelle,ancien_id_parcelle,numero_volume,lot1_numero,lot1_surface_carrez,lot2_numero,lot2_surface_carrez,lot3_numero,lot3_surface_carrez,lot4_numero,lot4_surface_carrez,lot5_numero,lot5_surface_carrez,nombre_lots,code_type_local,type_local,surface_reelle_bati,nombre_pieces_principales,code_nature_culture,nature_culture,code_nature_culture_speciale,nature_culture_speciale,surface_terrain,longitude,latitude
2019-282920,2019-01-04,000001,Vente,20000,,,LA CHABAUDIE NORD,B018,24660,24312,Sanilhac,24,,,24312000BP0096,,,,,,,,,,,,,0,,,,,P,prés,,,2666,0.712651,45.122696
2019-282920,2019-01-04,000001,Vente,20000,,,LA CHABAUDIE NORD,B018,24660,24312,Sanilhac,24,,,24312000BP0097,,,,,,,,,,,,,0,,,,,P,prés,,,68,0.713348,45.122894
2019-282920,2019-01-04,000001,Vente,20000,,,LA CHABAUDIE NORD,B018,24660,24312,Sanilhac,24,,,24312000BP0100,,,,,,,,,,,,,0,,,,,P,prés,,,99,0.713435,45.122866
2019-282934,2019-01-18,000001,Vente,3475,,,LA TREMOUILLE,B087,24660,24312,Sanilhac,24,,,24312000BA0331,,,,,,,,,,,,,0,,,,,BT,taillis simples,CHENE,Chênes,139,0.710442,45.110039
2019-283000,2019-01-17,000001,Vente,120000,1138,,RTE DE SAINT PIERRE ES LIENS,0152,24660,24312,Sanilhac,24,,,24312000AT0021,,,,,,,,,,,,,0,1,Maison,117,5,S,sols,,,1000,0.724765,45.127086
2019-283000,2019-01-17,000001,Vente,120000,1138,,RTE DE SAINT PIERRE ES LIENS,0152,24660,24312,Sanilhac,24,,,24312000AT0021,,,,,,,,,,,,,0,1,Maison,117,5,BT,taillis simples,CHENE,Chênes,4121,0.724765,45.127086
2019-283069,2019-01-29,000001,Vente,80000,1000,,RTE DES GRAVAUX,1681,24380,24312,Sanilhac,24,,,243120650C0087,,,,,,,,,,,,,0,1,Maison,91,3,J,jardins,POTAG,Jardin potager,1150,0.763997,45.049278
2019-283069,2019-01-29,000001,Vente,80000,1000,,RTE DES GRAVAUX,1681,24380,24312,Sanilhac,24,,,243120650C0087,,,,,,,,,,,,,0,1,Maison,91,3,S,sols,,,500,0.763997,45.049278
2019-283089,2019-01-24,000001,Vente,110000,28,,AV J ET L PETITHOMME-LAFAYE,0072,24660,24312,Sanilhac,24,,,24312000AV0132,,,,,,,,,,,,,0,1,Maison,86,4,S,sols,,,974,0.716286,45.121541
2019-283089,2019-01-24,000001,Vente,110000,,,LE BOURG NOTRE DAME,B014,24660,24312,Sanilhac,24,,,24312000AV0134,,,,,,,,,,,,,0,,,,,S,sols,,,11,0.71622,45.121358
2019-283109,2019-01-30,000001,Vente,133780.2,,,LE BOURG NOTRE DAME,B014,24660,24312,Sanilhac,24,,,24312000AV0128,,,2,152.43,,,,,,,,,1,4,Local industriel. commercial ou assimilé,157,0,,,,,,0.715152,45.122264
2019-283138,2019-01-15,000001,Vente,1,,,LE PERRIER,B059,24660,24312,Sanilhac,24,,,24312000AA0337,,,,,,,,,,,,,0,,,,,L,landes,PATIS,Patis,4341,0.728878,45.175171
2019-283176,2019-02-07,000001,Vente,159240,36,,RUE DES MERLES,0093,24660,24312,Sanilhac,24,,,24312000CB0188,,,,,,,,,,,,,0,1,Maison,134,5,S,sols,,,1020,0.730773,45.172026
2019-283191,2019-01-31,000001,Vente,34000,,,LATOUR,B045,24660,24312,Sanilhac,24,,,24312000BC0179,,,,,,,,,,,,,0,,,,,P,prés,,,263,0.713777,45.096043
2019-283191,2019-01-31,000001,Vente,34000,,,LATOUR,B045,24660,24312,Sanilhac,24,,,24312000BC0179,,,,,,,,,,,,,0,,,,,T,terres,,,2606,0.713777,45.096043
2019-283191,2019-01-31,000001,Vente,34000,,,LATOUR,B045,24660,24312,Sanilhac,24,,,24312000BC0179,,,,,,,,,,,,,0,,,,,BS,taillis sous futaie,,,1426,0.713777,45.096043
2019-283195,2019-01-29,000001,Vente,24000,,,LATOUR,B045,24660,24312,Sanilhac,24,,,24312000BC0175,,,,,,,,,,,,,0,,,,,P,prés,,,2155,0.714687,45.096562
2019-283210,2019-02-14,000001,Vente,63000,27,,RUE DES CARRIERES,0031,24660,24312,Sanilhac,24,,,24312000AA0232,,,,,,,,,,,,,0,1,Maison,50,2,S,sols,,,60,0.728395,45.176588
2019-283224,2019-02-06,000001,Vente,20000,,,LES LANDES EST,B112,24380,24312,Sanilhac,24,,,243120650A0546,,,,,,,,,,,,,0,,,,,P,prés,,,167,0.740912,45.070096
2019-283224,2019-02-06,000001,Vente,20000,,,LES LANDES EST,B112,24380,24312,Sanilhac,24,,,243120650A0550,,,,,,,,,,,,,0,,,,,P,prés,,,946,0.74074,45.069753
2019-283224,2019-02-06,000001,Vente,20000,,,LA BOUDONNIE,B099,24380,24312,Sanilhac,24,,,243120650A0551,,,,,,,,,,,,,0,,,,,P,prés,,,771,0.740876,45.069637
2019-283274,2019-02-01,000001,Vente,203000,18,,RUE DES MESANGES,0097,24660,24312,Sanilhac,24,,,24312000AA0145,,,,,,,,,,,,,0,1,Maison,106,3,T,terres,,,2469,0.729617,45.173359
2019-283274,2019-02-01,000001,Vente,203000,18,,RUE DES MESANGES,0097,24660,24312,Sanilhac,24,,,24312000AA0145,,,,,,,,,,,,,0,1,Maison,106,3,S,sols,,,1000,0.729617,45.173359
2019-283306,2019-02-06,000001,Vente,161000,,,LE CAMAR,B102,24380,24312,Sanilhac,24,,,243120650A0348,,,,,,,,,,,,,0,,,,,P,prés,,,7860,0.738413,45.051075
2019-283306,2019-02-06,000001,Vente,161000,,,LE CAMAR,B102,24380,24312,Sanilhac,24,,,243120650A0349,,,,,,,,,,,,,0,,,,,P,prés,,,119,0.739186,45.051475
2019-283306,2019-02-06,000001,Vente,161000,689,,ALL DES CAMARDS,1630,24380,24312,Sanilhac,24,,,243120650A0350,,,,,,,,,,,,,0,1,Maison,120,5,J,jardins,POTAG,Jardin potager,1131,0.739084,45.051311
2019-283306,2019-02-06,000001,Vente,161000,689,,ALL DES CAMARDS,1630,24380,24312,Sanilhac,24,,,243120650A0350,,,,,,,,,,,,,0,1,Maison,120,5,S,sols,,,500,0.739084,45.051311
2019-283306,2019-02-06,000001,Vente,161000,,,LE CAMAR,B102,24380,24312,Sanilhac,24,,,243120650A0424,,,,,,,,,,,,,0,,,,,T,terres,,,1670,0.73812,45.051393
2019-283306,2019-02-06,000001,Vente,161000,,,LE CAMAR,B102,24380,24312,Sanilhac,24,,,243120650A0426,,,,,,,,,,,,,0,,,,,BT,taillis simples,CHENE,Chênes,265,0.739367,45.051573
2019-283306,2019-02-06,000001,Vente,161000,,,LE CAMAR,B102,24380,24312,Sanilhac,24,,,243120650A0454,,,,,,,,,,,,,0,,,,,T,terres,,,375,0.738278,45.051423
2019-283341,2019-02-01,000001,Vente,435000,5,,ALL DE TOUVENT,0406,24660,24312,Sanilhac,24,,,24312000CE0149,,,,,,,,,,,,,0,3,Dépendance,,0,AG,terrains d'agrément,PARC,Parc,450,0.723756,45.169469
2019-283341,2019-02-01,000001,Vente,435000,5,,ALL DE TOUVENT,0406,24660,24312,Sanilhac,24,,,24312000CE0149,,,,,,,,,,,,,0,1,Maison,146,4,AG,terrains d'agrément,PARC,Parc,450,0.723756,45.169469
2019-283341,2019-02-01,000001,Vente,435000,5,,ALL DE TOUVENT,0406,24660,24312,Sanilhac,24,,,24312000CE0149,,,,,,,,,,,,,0,1,Maison,146,4,S,sols,,,800,0.723756,45.169469
2019-283341,2019-02-01,000001,Vente,435000,5,,ALL DE TOUVENT,0406,24660,24312,Sanilhac,24,,,24312000CE0149,,,,,,,,,,,,,0,3,Dépendance,,0,S,sols,,,800,0.723756,45.169469
2019-283343,2019-02-06,000001,Vente,378000,9000,F,LA COUTURE,B026,24660,24312,Sanilhac,24,,,24312000BY0026,,,15,,8,259.89,,,,,,,2,4,Local industriel. commercial ou assimilé,87,0,,,,,,0.701636,45.136905
2019-283343,2019-02-06,000001,Vente,378000,9000,F,LA COUTURE,B026,24660,24312,Sanilhac,24,,,24312000BY0026,,,15,,8,259.89,,,,,,,2,4,Local industriel. commercial ou assimilé,167,0,,,,,,0.701636,45.136905
2019-283427,2019-03-01,000001,Vente,24100,,,LA BERTONNIE,B007,24660,24312,Sanilhac,24,,,24312000BM0058,,,,,,,,,,,,,0,,,,,AG,terrains d'agrément,PARC,Parc,902,0.696695,45.119767
2019-283446,2019-02-27,000001,Vente,194500,,,LA CHAUSSENIE,B025,24660,24312,Sanilhac,24,,,24312000AS0309,,,,,,,,,,,,,0,,,,,S,sols,,,185,0.727305,45.121
2019-283446,2019-02-27,000001,Vente,194500,532,,RTE DE LA BLANCHERIE,0296,24660,24312,Sanilhac,24,,,24312000AS0310,,,,,,,,,,,,,0,1,Maison,99,3,S,sols,,,800,0.727288,45.121215
2019-283446,2019-02-27,000001,Vente,194500,532,,RTE DE LA BLANCHERIE,0296,24660,24312,Sanilhac,24,,,24312000AS0310,,,,,,,,,,,,,0,1,Maison,99,3,AG,terrains d'agrément,PARC,Parc,1057,0.727288,45.121215
2019-283499,2019-02-20,000001,Echange,2000,,,CROIX DE MARTEL,B143,24750,24312,Sanilhac,24,,,243122580C0462,,,,,,,,,,,,,0,,,,,BM,futaies mixtes,,,9590,0.798159,45.066177
2019-283499,2019-02-20,000002,Echange,2000,,,CROIX DE MARTEL,B143,24750,24312,Sanilhac,24,,,243122580C0470,,,,,,,,,,,,,0,,,,,T,terres,,,2330,0.800471,45.067084
2019-283499,2019-02-20,000002,Echange,2000,,,CROIX DE MARTEL,B143,24750,24312,Sanilhac,24,,,243122580C0474,,,,,,,,,,,,,0,,,,,P,prés,,,1960,0.800017,45.067285
2019-283499,2019-02-20,000002,Echange,2000,,,CROIX DE MARTEL,B143,24750,24312,Sanilhac,24,,,243122580C0475,,,,,,,,,,,,,0,,,,,T,terres,,,3140,0.799719,45.067803
2019-283499,2019-02-20,000002,Echange,2000,,,CROIX DE MARTEL,B143,24750,24312,Sanilhac,24,,,243122580C0475,,,,,,,,,,,,,0,,,,,BM,futaies mixtes,,,1610,0.799719,45.067803
2019-283499,2019-02-20,000002,Echange,2000,,,CROIX DE MARTEL,B143,24750,24312,Sanilhac,24,,,243122580C0477,,,,,,,,,,,,,0,,,,,P,prés,,,3520,0.798826,45.067367
2019-283499,2019-02-20,000002,Echange,2000,,,CROIX DE MARTEL,B143,24750,24312,Sanilhac,24,,,243122580C0478,,,,,,,,,,,,,0,,,,,T,terres,,,1850,0.798732,45.067563
2019-283499,2019-02-20,000002,Echange,2000,,,CROIX DE MARTEL,B143,24750,24312,Sanilhac,24,,,243122580C0479,,,,,,,,,,,,,0,,,,,T,terres,,,3632,0.798214,45.067441
2019-283526,2019-02-26,000001,Vente,47500,,,THERME BLANC,B083,24660,24312,Sanilhac,24,,,24312000AO0272,,,,,,,,,,,,,0,,,,,AB,terrains a bâtir,,,1511,0.723228,45.149326
2019-283532,2019-01-31,000001,Vente,200000,,,LES BONNEIX-OUEST,B128,24750,24312,Sanilhac,24,,,243122580C0247,,,,,,,,,,,,,0,,,,,T,terres,,,648,0.78567,45.085251
2019-283532,2019-01-31,000001,Vente,200000,,,LES BONNEIX-OUEST,B128,24750,24312,Sanilhac,24,,,243122580C0248,,,,,,,,,,,,,0,,,,,T,terres,,,861,0.785765,45.085128
2019-283532,2019-01-31,000001,Vente,200000,,,LES BONNEIX-OUEST,B128,24750,24312,Sanilhac,24,,,243122580C0251,,,,,,,,,,,,,0,,,,,T,terres,,,1876,0.785955,45.084638
2019-283532,2019-01-31,000001,Vente,200000,,,LES BONNEIX-OUEST,B128,24750,24312,Sanilhac,24,,,243122580C0252,,,,,,,,,,,,,0,,,,,T,terres,,,1134,0.786144,45.084509
2019-283532,2019-01-31,000001,Vente,200000,1621,,RTE DE CHATEAU MISSIER,0800,24750,24312,Sanilhac,24,,,243122580C0737,,,,,,,,,,,,,0,1,Maison,68,2,S,sols,,,507,0.786196,45.085031
2019-283532,2019-01-31,000001,Vente,200000,,,LES BONNEIX-OUEST,B128,24750,24312,Sanilhac,24,,,243122580C0738,,,,,,,,,,,,,0,,,,,P,prés,,,2130,0.78614,45.084995
2019-283552,2019-03-08,000001,Vente,200000,,,LE BOURG NOTRE DAME,B014,24660,24312,Sanilhac,24,,,24312000AV0128,,,1,157.32,,,,,,,,,1,4,Local industriel. commercial ou assimilé,157,0,,,,,,0.715152,45.122264
2019-283614,2019-02-21,000001,Vente,6500,,,LA TUILIERE NOTRE DAME,B088,24660,24312,Sanilhac,24,,,24312000BC0022,,,,,,,,,,,,,0,,,,,BS,taillis sous futaie,,,4400,0.70937,45.097631
2019-283853,2019-03-12,000001,Vente,361000,,,HAUT MARTEL,B154,24750,24312,Sanilhac,24,,,243122580C0039,,,,,,,,,,,,,0,,,,,BT,taillis simples,CHENE,Chênes,393,0.78689,45.070978
2019-283853,2019-03-12,000001,Vente,361000,,,HAUT MARTEL,B154,24750,24312,Sanilhac,24,,,243122580C0040,,,,,,,,,,,,,0,,,,,T,terres,,,2984,0.786763,45.070428
2019-283853,2019-03-12,000001,Vente,361000,167,,CHE DES MAQUISARDS,1030,24750,24312,Sanilhac,24,,,243122580C0041,,,,,,,,,,,,,0,1,Maison,112,3,S,sols,,,400,0.786428,45.070501
2019-283853,2019-03-12,000001,Vente,361000,,,HAUT MARTEL,B154,24750,24312,Sanilhac,24,,,243122580C0042,,,,,,,,,,,,,0,,,,,S,sols,,,1000,0.786321,45.070544
2019-283853,2019-03-12,000001,Vente,361000,,,HAUT MARTEL,B154,24750,24312,Sanilhac,24,,,243122580C0042,,,,,,,,,,,,,0,,,,,P,prés,,,1840,0.786321,45.070544
2019-283853,2019-03-12,000001,Vente,361000,,,HAUT MARTEL,B154,24750,24312,Sanilhac,24,,,243122580C0042,,,,,,,,,,,,,0,,,,,AG,terrains d'agrément,,,2000,0.786321,45.070544
2019-283853,2019-03-12,000001,Vente,361000,,,HAUT MARTEL,B154,24750,24312,Sanilhac,24,,,243122580C0043,,,,,,,,,,,,,0,,,,,BM,futaies mixtes,,,4080,0.786156,45.071104
2019-283853,2019-03-12,000001,Vente,361000,,,HAUT MARTEL,B154,24750,24312,Sanilhac,24,,,243122580C0044,,,,,,,,,,,,,0,,,,,T,terres,,,456,0.785799,45.070876
2019-283853,2019-03-12,000001,Vente,361000,,,HAUT MARTEL,B154,24750,24312,Sanilhac,24,,,243122580C0045,,,,,,,,,,,,,0,,,,,P,prés,,,3143,0.785324,45.070544
2019-283853,2019-03-12,000001,Vente,361000,,,HAUT MARTEL,B154,24750,24312,Sanilhac,24,,,243122580C0046,,,,,,,,,,,,,0,,,,,BM,futaies mixtes,,,1389,0.78523,45.070029
2019-283853,2019-03-12,000001,Vente,361000,,,HAUT MARTEL,B154,24750,24312,Sanilhac,24,,,243122580C0047,,,,,,,,,,,,,0,,,,,BM,futaies mixtes,,,3620,0.7856,45.069803
2019-283853,2019-03-12,000001,Vente,361000,,,HAUT MARTEL,B154,24750,24312,Sanilhac,24,,,243122580C0048,,,,,,,,,,,,,0,,,,,BM,futaies mixtes,,,777,0.785528,45.069625
2019-283853,2019-03-12,000001,Vente,361000,,,HAUT MARTEL,B154,24750,24312,Sanilhac,24,,,243122580C0049,,,,,,,,,,,,,0,,,,,BM,futaies mixtes,,,1204,0.78483,45.069965
2019-283853,2019-03-12,000001,Vente,361000,,,HAUT MARTEL,B154,24750,24312,Sanilhac,24,,,243122580C0615,,,,,,,,,,,,,0,,,,,BM,futaies mixtes,,,826,0.785758,45.070124
2019-283877,2019-03-29,000001,Vente,50000,,,LA BOUDONNIE,B099,24380,24312,Sanilhac,24,,,243120650A0147,,,,,,,,,,,,,0,,,,,T,terres,,,4070,0.746759,45.065434
2019-283877,2019-03-29,000001,Vente,50000,,,LA BOUDONNIE,B099,24380,24312,Sanilhac,24,,,243120650A0231,,,,,,,,,,,,,0,,,,,BT,taillis simples,CHENE,Chênes,1136,0.745149,45.064695
2019-283877,2019-03-29,000001,Vente,50000,,,LA BOUDONNIE,B099,24380,24312,Sanilhac,24,,,243120650A0232,,,,,,,,,,,,,0,,,,,BT,taillis simples,CHENE,Chênes,2267,0.747647,45.065519
2019-283877,2019-03-29,000001,Vente,50000,,,LA BOUDONNIE,B099,24380,24312,Sanilhac,24,,,243120650A0232,,,,,,,,,,,,,0,,,,,T,terres,,,3090,0.747647,45.065519
2019-283877,2019-03-29,000001,Vente,50000,,,LA BOUDONNIE,B099,24380,24312,Sanilhac,24,,,243120650A0529,,,,,,,,,,,,,0,,,,,T,terres,,,15227,0.745985,45.0645
2019-283877,2019-03-29,000001,Vente,50000,,,LA BOUDONNIE,B099,24380,24312,Sanilhac,24,,,243120650A0531,,,,,,,,,,,,,0,,,,,S,sols,,,342,0.745055,45.064464
2019-283877,2019-03-29,000001,Vente,50000,,,LA BOUDONNIE,B099,24380,24312,Sanilhac,24,,,243120650A0532,,,,,,,,,,,,,0,,,,,S,sols,,,344,0.745413,45.064268
2019-283903,2019-04-09,000001,Vente,290000,88,,RTE DE BREUILH,1610,24380,24312,Sanilhac,24,,,243120650C0011,,,,,,,,,,,,,0,1,Maison,200,6,S,sols,,,660,0.754503,45.054168
2019-283903,2019-04-09,000001,Vente,290000,,,LE BOURG SUD,B101,24380,24312,Sanilhac,24,,,243120650C0012,,,,,,,,,,,,,0,,,,,P,prés,,,780,0.754367,45.054272
2019-283903,2019-04-09,000001,Vente,290000,,,LE BOURG SUD,B101,24380,24312,Sanilhac,24,,,243120650C0013,,,,,,,,,,,,,0,,,,,P,prés,,,3244,0.753955,45.053495
2019-283903,2019-04-09,000001,Vente,290000,,,LE BOURG SUD,B101,24380,24312,Sanilhac,24,,,243120650C0013,,,,,,,,,,,,,0,,,,,BR,futaies résineuses,,,1251,0.753955,45.053495
2019-283903,2019-04-09,000001,Vente,290000,,,LE BOURG SUD,B101,24380,24312,Sanilhac,24,,,243120650C0610,,,,,,,,,,,,,0,,,,,BT,taillis simples,CHAT,Châtaigneraie,9033,0.755529,45.053967
2019-283903,2019-04-09,000001,Vente,290000,,,LE BOURG SUD,B101,24380,24312,Sanilhac,24,,,243120650C0610,,,,,,,,,,,,,0,,,,,BR,futaies résineuses,,,9250,0.755529,45.053967
2019-283903,2019-04-09,000001,Vente,290000,,,LE BOURG SUD,B101,24380,24312,Sanilhac,24,,,243120650C0610,,,,,,,,,,,,,0,,,,,BT,taillis simples,CHAT,Châtaigneraie,4517,0.755529,45.053967
2019-283903,2019-04-09,000001,Vente,290000,,,LA MOUTHE,B116,24380,24312,Sanilhac,24,,,243120650C0761,,,,,,,,,,,,,0,,,,,BT,taillis simples,CHAT,Châtaigneraie,939,0.755792,45.055235
2019-283903,2019-04-09,000001,Vente,290000,,,LA MOUTHE,B116,24380,24312,Sanilhac,24,,,243120650C0762,,,,,,,,,,,,,0,,,,,BT,taillis simples,CHAT,Châtaigneraie,537,0.756217,45.053678
2019-283903,2019-04-09,000001,Vente,290000,,,LE BOURG SUD,B101,24380,24312,Sanilhac,24,,,243120650C0860,,,,,,,,,,,,,0,,,,,P,prés,,,16918,0.754593,45.054271
2019-283903,2019-04-09,000001,Vente,290000,,,LE BOURG SUD,B101,24380,24312,Sanilhac,24,,,243120650C0860,,,,,,,,,,,,,0,,,,,BR,futaies résineuses,,,764,0.754593,45.054271
2019-283909,2019-04-12,000001,Vente,2000,,,LATOUR,B045,24660,24312,Sanilhac,24,,,24312000BC0180,,,,,,,,,,,,,0,,,,,P,prés,,,299,0.715752,45.09692
2019-283909,2019-04-12,000001,Vente,2000,,,LATOUR,B045,24660,24312,Sanilhac,24,,,24312000BC0180,,,,,,,,,,,,,0,,,,,T,terres,,,2932,0.715752,45.09692
2019-283909,2019-04-12,000001,Vente,2000,,,LATOUR,B045,24660,24312,Sanilhac,24,,,24312000BC0180,,,,,,,,,,,,,0,,,,,BS,taillis sous futaie,,,1603,0.715752,45.09692
2019-283991,2019-04-12,000001,Vente,257500,3,,ALL DE TOUVENT,0406,24660,24312,Sanilhac,24,,,24312000CE0148,,,,,,,,,,,,,0,1,Maison,126,5,S,sols,,,800,0.723766,45.1691
2019-283991,2019-04-12,000001,Vente,257500,3,,ALL DE TOUVENT,0406,24660,24312,Sanilhac,24,,,24312000CE0148,,,,,,,,,,,,,0,1,Maison,126,5,AG,terrains d'agrément,PARC,Parc,869,0.723766,45.1691
2019-284042,2019-04-25,000001,Vente,138000,234,,RTE DE LA TERRASSE,1300,24750,24312,Sanilhac,24,,,24312258AB0323,,,,,,,,,,,,,0,1,Maison,88,4,AG,terrains d'agrément,,,703,0.787322,45.09579
2019-284042,2019-04-25,000001,Vente,138000,234,,RTE DE LA TERRASSE,1300,24750,24312,Sanilhac,24,,,24312258AB0323,,,,,,,,,,,,,0,1,Maison,88,4,S,sols,,,600,0.787322,45.09579
2019-284042,2019-04-25,000001,Vente,138000,,,CROIX DE LA GUILLAUMIE,B142,24750,24312,Sanilhac,24,,,24312258AB0344,,,,,,,,,,,,,0,,,,,BM,futaies mixtes,,,31,0.787105,45.095732
2019-284042,2019-04-25,000001,Vente,138000,,,CROIX DE LA GUILLAUMIE,B142,24750,24312,Sanilhac,24,,,24312258AB0373,,,,,,,,,,,,,0,,,,,BM,futaies mixtes,,,111,0.787125,45.095753
2019-284086,2019-04-24,000001,Vente,23000,,,LA CHABAUDIE NORD,B018,24660,24312,Sanilhac,24,,,24312000BP0094,,,,,,,,,,,,,0,,,,,P,prés,,,3122,,
2019-284086,2019-04-24,000001,Vente,23000,,,LA CHABAUDIE NORD,B018,24660,24312,Sanilhac,24,,,24312000BP0095,,,,,,,,,,,,,0,,,,,P,prés,,,135,0.71327,45.123085
2019-284086,2019-04-24,000001,Vente,23000,,,LA CHABAUDIE NORD,B018,24660,24312,Sanilhac,24,,,24312000BP0099,,,,,,,,,,,,,0,,,,,P,prés,,,178,0.713431,45.122953
2019-284138,2019-04-29,000001,Vente,95000,18,,RUE DES CARRIERES,0031,24660,24312,Sanilhac,24,,,24312000AA0211,,,,,,,,,,,,,0,,,,,S,sols,,,25,0.727535,45.176121
2019-284138,2019-04-29,000001,Vente,95000,18,B,RUE DES CARRIERES,0031,24660,24312,Sanilhac,24,,,24312000AA0212,,,,,,,,,,,,,0,1,Maison,45,2,S,sols,,,49,0.727579,45.17615
2019-284143,2019-04-29,000001,Vente,62000,,,LA MALETIE,B047,24660,24312,Sanilhac,24,,,24312000AP0312,,,,,,,,,,,,,0,,,,,P,prés,,,2084,0.724423,45.132789
2019-284143,2019-04-29,000001,Vente,62000,,,LA MALETIE,B047,24660,24312,Sanilhac,24,,,24312000AP0316,,,,,,,,,,,,,0,,,,,P,prés,,,147,0.724952,45.132767
2019-284146,2019-04-19,000001,Vente,11000,,,CHAMP,B021,24660,24312,Sanilhac,24,,,24312000AS0040,,,,,,,,,,,,,0,,,,,T,terres,,,35742,0.738401,45.121401
2019-284146,2019-04-19,000001,Vente,11000,,,CHAMP,B021,24660,24312,Sanilhac,24,,,24312000AS0040,,,,,,,,,,,,,0,,,,,BS,taillis sous futaie,,,32878,0.738401,45.121401
2019-284215,2019-04-16,000001,Vente,6000,,,PUITS TROUILLER,B069,24660,24312,Sanilhac,24,,,24312000BB0043,,,,,,,,,,,,,0,,,,,BT,taillis simples,CHENE,Chênes,1832,0.709915,45.104652
2019-284215,2019-04-16,000001,Vente,6000,,,PUITS TROUILLER,B069,24660,24312,Sanilhac,24,,,24312000BB0048,,,,,,,,,,,,,0,,,,,BS,taillis sous futaie,,,14022,0.709638,45.101784
2019-284215,2019-04-16,000001,Vente,6000,,,SUDRAT,B082,24660,24312,Sanilhac,24,,,24312000BC0009,,,,,,,,,,,,,0,,,,,BS,taillis sous futaie,,,7357,0.707474,45.099164
2019-284215,2019-04-16,000001,Vente,6000,,,PUITS TROUILLER,B069,24660,24312,Sanilhac,24,,,24312000BC0011,,,,,,,,,,,,,0,,,,,BS,taillis sous futaie,,,14014,0.708418,45.100638
2019-284215,2019-04-16,000001,Vente,6000,,,LA CHABAUDIE SUD,B019,24660,24312,Sanilhac,24,,,24312000BN0043,,,,,,,,,,,,,0,,,,,BS,taillis sous futaie,,,2342,0.709791,45.116088
2019-284216,2019-04-16,000001,Vente,12000,,,SANILHAC,B078,24660,24312,Sanilhac,24,,,24312000BA0010,,,,,,,,,,,,,0,,,,,BT,taillis simples,CHENE,Chênes,10000,0.707309,45.11445
2019-284216,2019-04-16,000001,Vente,12000,,,SANILHAC,B078,24660,24312,Sanilhac,24,,,24312000BA0010,,,,,,,,,,,,,0,,,,,BS,taillis sous futaie,,,39809,0.707309,45.11445
2019-284216,2019-04-16,000001,Vente,12000,,,LA RENAUDIE,B075,24660,24312,Sanilhac,24,,,24312000BA0026,,,,,,,,,,,,,0,,,,,BS,taillis sous futaie,,,33248,0.711737,45.114727
2019-284247,2019-04-29,000001,Vente,41000,,,LA BERTHOMARIE MARSANEIX,B126,24750,24312,Sanilhac,24,,,243122580F1212,,,,,,,,,,,,,0,,,,,P,prés,,,2346,0.745091,45.103054
2019-284247,2019-04-29,000001,Vente,41000,,,LA BERTHOMARIE MARSANEIX,B126,24750,24312,Sanilhac,24,,,243122580F1214,,,,,,,,,,,,,0,,,,,L,landes,BROUS,Broussailles ou buissons,664,0.745127,45.102901
2019-284340,2019-05-07,000001,Vente,1500,,,PUY D AIGUILLON,B070,24660,24312,Sanilhac,24,,,24312000BZ0106,,,,,,,,,,,,,0,,,,,L,landes,PATIS,Patis,68,0.694173,45.137995
2019-284340,2019-05-07,000001,Vente,1500,,,PUY D AIGUILLON,B070,24660,24312,Sanilhac,24,,,24312000BZ0108,,,,,,,,,,,,,0,,,,,L,landes,PATIS,Patis,26,0.694164,45.138066
2019-284418,2019-05-09,000001,Vente,5000,,,LA CHABAUDIE NORD,B018,24660,24312,Sanilhac,24,,,24312000BP0106,,,,,,,,,,,,,0,,,,,P,prés,,,218,0.712428,45.122024
2019-284419,2019-05-09,000002,Vente,14000,,,LA CHABAUDIE NORD,B018,24660,24312,Sanilhac,24,,,24312000BP0105,,,,,,,,,,,,,0,,,,,BT,taillis simples,CHENE,Chênes,465,0.712134,45.122126
2019-284419,2019-05-09,000002,Vente,14000,,,LA CHABAUDIE NORD,B018,24660,24312,Sanilhac,24,,,24312000BP0105,,,,,,,,,,,,,0,,,,,P,prés,,,444,0.712134,45.122126
2019-284440,2019-05-14,000001,Vente,350000,,,PUY D AIGUILLON,B070,24660,24312,Sanilhac,24,,,24312000BZ0084,,,,,,,,,,,,,0,,,,,AG,terrains d'agrément,PARC,Parc,268,0.693788,45.138512
2019-284440,2019-05-14,000001,Vente,350000,409,,ALL DU PUY D'AIGUILLON,0380,24660,24312,Sanilhac,24,,,24312000BZ0085,,,,,,,,,,,,,0,1,Maison,215,7,AG,terrains d'agrément,PARC,Parc,1359,0.693585,45.138353
2019-284440,2019-05-14,000001,Vente,350000,409,,ALL DU PUY D'AIGUILLON,0380,24660,24312,Sanilhac,24,,,24312000BZ0085,,,,,,,,,,,,,0,1,Maison,215,7,S,sols,,,500,0.693585,45.138353
2019-284440,2019-05-14,000001,Vente,350000,,,PUY D AIGUILLON,B070,24660,24312,Sanilhac,24,,,24312000BZ0088,,,,,,,,,,,,,0,,,,,AG,terrains d'agrément,PARC,Parc,1222,0.69395,45.138342
2019-284440,2019-05-14,000001,Vente,350000,,,PUY D AIGUILLON,B070,24660,24312,Sanilhac,24,,,24312000BZ0106,,,,,,,,,,,,,0,,,,,L,landes,PATIS,Patis,68,0.694173,45.137995
2019-284440,2019-05-14,000001,Vente,350000,,,PUY D AIGUILLON,B070,24660,24312,Sanilhac,24,,,24312000BZ0108,,,,,,,,,,,,,0,,,,,L,landes,PATIS,Patis,26,0.694164,45.138066
2019-284545,2019-04-30,000001,Vente,60000,,,BORIE MARTY,B012,24660,24312,Sanilhac,24,,,24312000BW0090,,,,,,,,,,,,,0,,,,,AB,terrains a bâtir,,,1815,0.699031,45.133144
2019-284590,2019-06-06,000001,Vente,35000,,,PUY D AIGUILLON,B070,24660,24312,Sanilhac,24,,,24312000BZ0096,,,,,,,,,,,,,0,,,,,BR,futaies résineuses,,,4,0.694577,45.135267
2019-284590,2019-06-06,000001,Vente,35000,,,PUY D AIGUILLON,B070,24660,24312,Sanilhac,24,,,24312000CA0258,,,,,,,,,,,,,0,,,,,BT,taillis simples,CHENE,Chênes,1594,0.694357,45.135405
2019-284627,2019-05-21,000001,Vente,377000,436,,RTE DE LA BLANCHERIE,0296,24660,24312,Sanilhac,24,,,24312000AS0006,,,,,,,,,,,,,0,1,Maison,139,6,AG,terrains d'agrément,PARC,Parc,2000,0.727952,45.122214
2019-284627,2019-05-21,000001,Vente,377000,436,,RTE DE LA BLANCHERIE,0296,24660,24312,Sanilhac,24,,,24312000AS0006,,,,,,,,,,,,,0,1,Maison,139,6,S,sols,,,500,0.727952,45.122214
2019-284627,2019-05-21,000001,Vente,377000,436,,RTE DE LA BLANCHERIE,0296,24660,24312,Sanilhac,24,,,24312000AS0006,,,,,,,,,,,,,0,1,Maison,139,6,BS,taillis sous futaie,,,871,0.727952,45.122214
2019-284718,2019-06-03,000001,Vente,71000,12,,RTE DE BERGERAC,0012,24660,24312,Sanilhac,24,,,24312000AA0037,,,12,,6,,,,,,,,2,2,Appartement,62,3,,,,,,0.725365,45.17679
2019-284718,2019-06-03,000001,Vente,71000,12,,RTE DE BERGERAC,0012,24660,24312,Sanilhac,24,,,24312000AA0037,,,18,,,,,,,,,,1,3,Dépendance,,0,,,,,,0.725365,45.17679
2019-284761,2019-06-24,000001,Vente,28000,,,LES BONNEIX-OUEST,B128,24750,24312,Sanilhac,24,,,243122580C0723,,,,,,,,,,,,,0,,,,,P,prés,,,1977,0.784275,45.08686
2019-284761,2019-06-24,000001,Vente,28000,,,LES BONNEIX-OUEST,B128,24750,24312,Sanilhac,24,,,243122580C0728,,,,,,,,,,,,,0,,,,,T,terres,,,75,0.78392,45.08658