id_mutation,date_mutation,numero_disposition,nature_mutation,valeur_fonciere,adresse_numero,adresse_suffixe,adresse_nom_voie,adresse_code_voie,code_postal,code_commune,nom_commune,code_departement,ancien_code_commune,ancien_nom_commune,id_parcelle,ancien_id_parcelle,numero_volume,lot1_numero,lot1_surface_carrez,lot2_numero,lot2_surface_carrez,lot3_numero,lot3_surface_carrez,lot4_numero,lot4_surface_carrez,lot5_numero,lot5_surface_carrez,nombre_lots,code_type_local,type_local,surface_reelle_bati,nombre_pieces_principales,code_nature_culture,nature_culture,code_nature_culture_speciale,nature_culture_speciale,surface_terrain,longitude,latitude
2019-283013,2019-01-03,000001,Vente,144000,9,,RTE DU PIC,0118,24420,24513,Saint-Vincent-sur-l'Isle,24,,,245130000A0694,,,,,,,,,,,,,0,1,Maison,146,6,AG,terrains d'agrément,PARC,Parc,1201,0.906586,45.23848
2019-283013,2019-01-03,000001,Vente,144000,9,,RTE DU PIC,0118,24420,24513,Saint-Vincent-sur-l'Isle,24,,,245130000A0694,,,,,,,,,,,,,0,1,Maison,146,6,S,sols,,,800,0.906586,45.23848
2019-285245,2019-06-27,000001,Vente,150,,,LES DAUZELLES,B014,24420,24513,Saint-Vincent-sur-l'Isle,24,,,245130000C0335,,,,,,,,,,,,,0,,,,,L,landes,BROUS,Broussailles ou buissons,145,0.890659,45.250781
2019-285315,2019-07-26,000001,Vente,85000,29,,AV DU RELAIS DE POSTE,0145,24420,24513,Saint-Vincent-sur-l'Isle,24,,,245130000C0304,,,,,,,,,,,,,0,1,Maison,106,3,S,sols,,,670,0.888383,45.245533
2019-285315,2019-07-26,000001,Vente,85000,,,FAUGERAS,B015,24420,24513,Saint-Vincent-sur-l'Isle,24,,,245130000C0315,,,,,,,,,,,,,0,,,,,T,terres,,,5825,0.8868,45.245624
2019-285315,2019-07-26,000001,Vente,85000,,,FAUGERAS,B015,24420,24513,Saint-Vincent-sur-l'Isle,24,,,245130000C0471,,,,,,,,,,,,,0,,,,,P,prés,,,217,0.886219,45.24476
2019-285315,2019-07-26,000001,Vente,85000,,,FAUGERAS,B015,24420,24513,Saint-Vincent-sur-l'Isle,24,,,245130000C0477,,,,,,,,,,,,,0,,,,,P,prés,,,794,0.886544,45.245851
2019-285315,2019-07-26,000001,Vente,85000,,,FAUGERAS,B015,24420,24513,Saint-Vincent-sur-l'Isle,24,,,245130000C0629,,,,,,,,,,,,,0,,,,,T,terres,,,1460,0.888394,45.245375
2019-285315,2019-07-26,000001,Vente,85000,,,FAUGERAS,B015,24420,24513,Saint-Vincent-sur-l'Isle,24,,,245130000C0632,,,,,,,,,,,,,0,,,,,T,terres,,,313,0.887615,45.244943
2019-285315,2019-07-26,000001,Vente,85000,,,FAUGERAS,B015,24420,24513,Saint-Vincent-sur-l'Isle,24,,,245130000C0634,,,,,,,,,,,,,0,,,,,T,terres,,,7836,0.887385,45.245518
2019-285315,2019-07-26,000001,Vente,85000,,,FAUGERAS,B015,24420,24513,Saint-Vincent-sur-l'Isle,24,,,245130000C0636,,,,,,,,,,,,,0,,,,,P,prés,,,4077,0.886153,45.244971
