id_mutation,date_mutation,numero_disposition,nature_mutation,valeur_fonciere,adresse_numero,adresse_suffixe,adresse_nom_voie,adresse_code_voie,code_postal,code_commune,nom_commune,code_departement,ancien_code_commune,ancien_nom_commune,id_parcelle,ancien_id_parcelle,numero_volume,lot1_numero,lot1_surface_carrez,lot2_numero,lot2_surface_carrez,lot3_numero,lot3_surface_carrez,lot4_numero,lot4_surface_carrez,lot5_numero,lot5_surface_carrez,nombre_lots,code_type_local,type_local,surface_reelle_bati,nombre_pieces_principales,code_nature_culture,nature_culture,code_nature_culture_speciale,nature_culture_speciale,surface_terrain,longitude,latitude
2019-305193,2019-05-06,000001,Vente,35000,1066,,AU VILLAGE MONTURSIN,B229,25190,25275,Glère,25,,,252754070B0186,,,,,,,,,,,,,0,1,Maison,18,1,S,sols,,,1000,6.935563,47.34901
2019-305544,2019-06-28,000001,Vente,135500,7,,AU CLOS DE LA LAVE,B052,25190,25275,Glère,25,,,252756060B0302,,,,,,,,,,,,,0,1,Maison,216,5,S,sols,,,1426,6.972322,47.350779
2019-305544,2019-06-28,000001,Vente,135500,,,AU CLOS DE LA LAVE,B052,25190,25275,Glère,25,,,252756060B0303,,,,,,,,,,,,,0,,,,,VE,vergers,,,4317,6.972371,47.350492
2019-305544,2019-06-28,000001,Vente,135500,,,AU CLOS DE LA LAVE,B052,25190,25275,Glère,25,,,252756060B0307,,,,,,,,,,,,,0,,,,,P,prés,,,701,6.971923,47.350798
2019-305544,2019-06-28,000001,Vente,135500,,,AU CLOS DE LA LAVE,B052,25190,25275,Glère,25,,,252756060B0308,,,,,,,,,,,,,0,,,,,P,prés,,,497,6.97265,47.350757
2019-305544,2019-06-28,000001,Vente,135500,,,AU CLOS DE LA LAVE,B052,25190,25275,Glère,25,,,252756060B0309,,,,,,,,,,,,,0,,,,,P,prés,,,585,6.972498,47.350211
2019-305712,2019-06-27,000001,Vente,5000,,,AUX PLANCHES,B160,25190,25275,Glère,25,,,252756060B0174,,,,,,,,,,,,,0,,,,,P,prés,,,24720,6.961218,47.353252
2019-305717,2019-07-12,000001,Vente,40000,1097,,AU VILLAGE VERNOIS,B230,25190,25275,Glère,25,,,252756060A0210,,,,,,,,,,,,,0,1,Maison,24,1,P,prés,,,1350,6.991425,47.347182
2019-305717,2019-07-12,000001,Vente,40000,1097,,AU VILLAGE VERNOIS,B230,25190,25275,Glère,25,,,252756060A0210,,,,,,,,,,,,,0,1,Maison,24,1,S,sols,,,500,6.991425,47.347182
2019-305860,2019-07-19,000001,Vente,134000,7,,RUE DES GRANDES FINS,0080,25190,25275,Glère,25,,,252750000A0586,,,,,,,,,,,,,0,1,Maison,83,3,S,sols,,,1022,7.005918,47.34477
2019-306164,2019-08-20,000002,Vente,88000,,,COMMUNAL DE GLERE,B072,25190,25275,Glère,25,,,252750000A0610,,,,,,,,,,,,,0,,,,,S,sols,,,489,7.00574,47.344531
2019-306165,2019-08-16,000001,Vente,164000,,,LE VILLAGE DE GLERE,B228,25190,25275,Glère,25,,,252750000A0199,,,,,,,,,,,,,0,,,,,S,sols,,,279,6.994554,47.343984
2019-306165,2019-08-16,000001,Vente,164000,1,,RUE PRINCIPALE,0150,25190,25275,Glère,25,,,252750000A0200,,,,,,,,,,,,,0,2,Appartement,50,4,S,sols,,,900,6.994811,47.343969
2019-306165,2019-08-16,000001,Vente,164000,1,,RUE PRINCIPALE,0150,25190,25275,Glère,25,,,252750000A0200,,,,,,,,,,,,,0,2,Appartement,50,3,S,sols,,,900,6.994811,47.343969
2019-306165,2019-08-16,000001,Vente,164000,1,,RUE PRINCIPALE,0150,25190,25275,Glère,25,,,252750000A0200,,,,,,,,,,,,,0,2,Appartement,100,4,S,sols,,,900,6.994811,47.343969
2019-306165,2019-08-16,000001,Vente,164000,,,LE VILLAGE DE GLERE,B228,25190,25275,Glère,25,,,252750000A0201,,,,,,,,,,,,,0,,,,,VE,vergers,,,695,6.994662,47.343779
2019-306169,2019-08-20,000001,Vente,40,,,COMMUNAL DE GLERE,B072,25190,25275,Glère,25,,,252750000A0587,,,,,,,,,,,,,0,,,,,S,sols,,,4,7.005943,47.344618
2019-306719,2019-10-23,000001,Vente,15000,3,,RUE DU FOSSAY,0066,25190,25275,Glère,25,,,252750000A0233,,,,,,,,,,,,,0,1,Maison,208,2,S,sols,,,841,6.993386,47.343928
