id_mutation,date_mutation,numero_disposition,nature_mutation,valeur_fonciere,adresse_numero,adresse_suffixe,adresse_nom_voie,adresse_code_voie,code_postal,code_commune,nom_commune,code_departement,ancien_code_commune,ancien_nom_commune,id_parcelle,ancien_id_parcelle,numero_volume,lot1_numero,lot1_surface_carrez,lot2_numero,lot2_surface_carrez,lot3_numero,lot3_surface_carrez,lot4_numero,lot4_surface_carrez,lot5_numero,lot5_surface_carrez,nombre_lots,code_type_local,type_local,surface_reelle_bati,nombre_pieces_principales,code_nature_culture,nature_culture,code_nature_culture_speciale,nature_culture_speciale,surface_terrain,longitude,latitude
2019-295096,2019-01-04,000001,Vente,40000,21,,RUE DES FONTAINES,0046,25680,25377,Mésandans,25,,,253770000B0366,,,,,,,,,,,,,0,1,Maison,69,3,S,sols,,,365,6.36885,47.430962
2019-298128,2019-07-22,000001,Vente,79920,,,LE VILLAGE,B115,25680,25377,Mésandans,25,,,253770000B0360,,,,,,,,,,,,,0,,,,,S,sols,,,291,6.368293,47.43006
2019-298128,2019-07-22,000001,Vente,79920,,,LE VILLAGE,B115,25680,25377,Mésandans,25,,,253770000B0360,,,,,,,,,,,,,0,,,,,J,jardins,,,627,6.368293,47.43006
2019-298128,2019-07-22,000001,Vente,79920,31,,RUE DES FONTAINES,0046,25680,25377,Mésandans,25,,,253770000B0361,,,,,,,,,,,,,0,1,Maison,90,3,S,sols,,,262,6.368339,47.430178
2019-299419,2019-10-16,000002,Vente,17000,,,AUX CONTOURS ET A LA CROIX,B039,25680,25377,Mésandans,25,,,253770000B0939,,,,,,,,,,,,,0,,,,,J,jardins,,,200,6.366464,47.429638
2019-299419,2019-10-16,000002,Vente,17000,,,AUX CONTOURS ET A LA CROIX,B039,25680,25377,Mésandans,25,,,253770000B0941,,,,,,,,,,,,,0,,,,,J,jardins,,,129,6.366497,47.429749
2019-299419,2019-10-16,000002,Vente,17000,,,AUX CONTOURS ET A LA CROIX,B039,25680,25377,Mésandans,25,,,253770000B0943,,,,,,,,,,,,,0,,,,,J,jardins,,,231,6.366474,47.429871
2019-300467,2019-12-23,000001,Vente,200,,,SUR TOUVIERE,B107,25680,25377,Mésandans,25,,,25377000ZD0142,,,,,,,,,,,,,0,,,,,L,landes,FRICH,Friche,1443,6.376765,47.427798
2019-300467,2019-12-23,000001,Vente,200,,,SUR TOUVIERE,B107,25680,25377,Mésandans,25,,,25377000ZD0142,,,,,,,,,,,,,0,,,,,P,prés,,,1410,6.376765,47.427798
