id_mutation,date_mutation,numero_disposition,nature_mutation,valeur_fonciere,adresse_numero,adresse_suffixe,adresse_nom_voie,adresse_code_voie,code_postal,code_commune,nom_commune,code_departement,ancien_code_commune,ancien_nom_commune,id_parcelle,ancien_id_parcelle,numero_volume,lot1_numero,lot1_surface_carrez,lot2_numero,lot2_surface_carrez,lot3_numero,lot3_surface_carrez,lot4_numero,lot4_surface_carrez,lot5_numero,lot5_surface_carrez,nombre_lots,code_type_local,type_local,surface_reelle_bati,nombre_pieces_principales,code_nature_culture,nature_culture,code_nature_culture_speciale,nature_culture_speciale,surface_terrain,longitude,latitude
2019-308181,2019-02-08,000001,Vente,98,,,LE VILLAGE,B068,26120,26081,Châteaudouble,26,,,260810000C0725,,,,,,,,,,,,,0,,,,,S,sols,,,98,5.095768,44.900531
2019-308578,2019-02-15,000002,Vente,307100,580,,CHE DE COTON,0003,26120,26081,Châteaudouble,26,,,260810000E0354,,,,,,,,,,,,,0,1,Maison,107,5,S,sols,,,500,5.101446,44.895422
2019-308578,2019-02-15,000002,Vente,307100,580,,CHE DE COTON,0003,26120,26081,Châteaudouble,26,,,260810000E0354,,,,,,,,,,,,,0,1,Maison,107,5,T,terres,,,2000,5.101446,44.895422
2019-308990,2019-03-15,000001,Vente,223000,,,GRAND LIERNE,B035,26120,26081,Châteaudouble,26,,,26081000ZC0098,,,,,,,,,,,,,0,,,,,S,sols,,,521,5.070004,44.912376
2019-309016,2019-03-15,000001,Vente,100,,,GRAND LIERNE,B035,26120,26081,Châteaudouble,26,,,26081000ZC0099,,,,,,,,,,,,,0,,,,,S,sols,,,274,5.070098,44.912573
2019-309500,2019-03-25,000001,Vente,20000,,,LES ALLEMANDS,B001,26120,26081,Châteaudouble,26,,,26081000ZD0049,,,,,,,,,,,,,0,,,,,S,sols,,,1354,5.071514,44.92197
2019-309508,2019-03-27,000001,Vente,141100.8,,,LES CAVARDES,B009,26120,26081,Châteaudouble,26,,,260810000E0003,,,,,,,,,,,,,0,,,,,BT,taillis simples,,,18160,5.088122,44.886434
2019-309508,2019-03-27,000001,Vente,141100.8,,,LES PERPOINTS,B046,26120,26081,Châteaudouble,26,,,260810000E0033,,,,,,,,,,,,,0,,,,,BT,taillis simples,,,10050,5.0932,44.892728
2019-309508,2019-03-27,000001,Vente,141100.8,,,LES PERPOINTS,B046,26120,26081,Châteaudouble,26,,,260810000E0036,,,,,,,,,,,,,0,,,,,BT,taillis simples,,,7240,5.096349,44.894918
2019-309508,2019-03-27,000001,Vente,141100.8,,,LES PERPOINTS,B046,26120,26081,Châteaudouble,26,,,260810000E0037,,,,,,,,,,,,,0,,,,,BT,taillis simples,,,2350,5.095557,44.894968
2019-309508,2019-03-27,000001,Vente,141100.8,,,LES PERPOINTS,B046,26120,26081,Châteaudouble,26,,,260810000E0069,,,,,,,,,,,,,0,,,,,BT,taillis simples,,,18103,5.096432,44.896115
2019-309508,2019-03-27,000001,Vente,141100.8,,,LES TOUCHES,B063,26120,26081,Châteaudouble,26,,,260810000E0106,,,,,,,,,,,,,0,,,,,BT,taillis simples,,,32310,5.09561,44.890467
2019-309508,2019-03-27,000001,Vente,141100.8,,,LES PERPOINTS,B046,26120,26081,Châteaudouble,26,,,260810000E0394,,,,,,,,,,,,,0,,,,,T,terres,,,3435,5.089448,44.892089
2019-309508,2019-03-27,000001,Vente,141100.8,,,LES PERPOINTS,B046,26120,26081,Châteaudouble,26,,,260810000E0395,,,,,,,,,,,,,0,,,,,T,terres,,,6679,5.089353,44.891727
2019-309508,2019-03-27,000001,Vente,141100.8,,,LES PERPOINTS,B046,26120,26081,Châteaudouble,26,,,260810000E0443,,,,,,,,,,,,,0,,,,,T,terres,,,8008,5.091826,44.893837
2019-309508,2019-03-27,000001,Vente,141100.8,,,LES PERPOINTS,B046,26120,26081,Châteaudouble,26,,,260810000E0444,,,,,,,,,,,,,0,,,,,T,terres,,,53,5.091945,44.89431
2019-309508,2019-03-27,000001,Vente,141100.8,,,LES PERPOINTS,B046,26120,26081,Châteaudouble,26,,,260810000E0446,,,,,,,,,,,,,0,,,,,T,terres,,,49,5.092086,44.894382
2019-309508,2019-03-27,000001,Vente,141100.8,,,LE GRENOUILLET,B037,26120,26081,Châteaudouble,26,,,26081000ZB0141,,,,,,,,,,,,,0,,,,,T,terres,,,4821,5.071911,44.904556
2019-309508,2019-03-27,000001,Vente,141100.8,,,LE GRENOUILLET,B037,26120,26081,Châteaudouble,26,,,26081000ZB0141,,,,,,,,,,,,,0,,,,,T,terres,,,19654,5.071911,44.904556
2019-309509,2019-03-27,000001,Vente,33046.2,,,LES PERPOINTS,B046,26120,26081,Châteaudouble,26,,,260810000E0030,,,,,,,,,,,,,0,,,,,BT,taillis simples,,,5620,5.091838,44.892384
2019-309509,2019-03-27,000001,Vente,33046.2,,,LES PERPOINTS,B046,26120,26081,Châteaudouble,26,,,260810000E0031,,,,,,,,,,,,,0,,,,,T,terres,,,10160,5.091251,44.892675
2019-309509,2019-03-27,000001,Vente,33046.2,,,LES PERPOINTS,B046,26120,26081,Châteaudouble,26,,,260810000E0038,,,,,,,,,,,,,0,,,,,BT,taillis simples,,,60,5.094903,44.89508
2019-309509,2019-03-27,000001,Vente,33046.2,,,LES PERPOINTS,B046,26120,26081,Châteaudouble,26,,,260810000E0064,,,,,,,,,,,,,0,,,,,T,terres,,,25690,5.09509,44.896151
2019-309509,2019-03-27,000001,Vente,33046.2,,,LES PERPOINTS,B046,26120,26081,Châteaudouble,26,,,260810000E0065,,,,,,,,,,,,,0,,,,,P,prés,,,2270,5.095446,44.8959
2019-309509,2019-03-27,000001,Vente,33046.2,,,LES PERPOINTS,B046,26120,26081,Châteaudouble,26,,,260810000E0066,,,,,,,,,,,,,0,,,,,L,landes,PATUR,Pâture plantée,1250,5.095533,44.895641
2019-309509,2019-03-27,000001,Vente,33046.2,,,LES PERPOINTS,B046,26120,26081,Châteaudouble,26,,,260810000E0067,,,,,,,,,,,,,0,,,,,BT,taillis simples,,,3277,5.096167,44.89604
2019-309509,2019-03-27,000001,Vente,33046.2,,,LES PERPOINTS,B046,26120,26081,Châteaudouble,26,,,260810000E0068,,,,,,,,,,,,,0,,,,,BT,taillis simples,,,3375,5.095149,44.896593
2019-309509,2019-03-27,000001,Vente,33046.2,,,LES PERPOINTS,B046,26120,26081,Châteaudouble,26,,,260810000E0068,,,,,,,,,,,,,0,,,,,BT,taillis simples,,,3375,5.095149,44.896593
2019-310036,2019-04-30,000001,Vente,227000,35,,MTE DES RAMUS,0043,26120,26081,Châteaudouble,26,,,260810000C0646,,,,,,,,,,,,,0,1,Maison,84,4,S,sols,,,325,5.096066,44.900603
2019-310458,2019-05-21,000001,Vente,2000,,,LA RICHARDIERE,B055,26120,26081,Châteaudouble,26,,,260810000C0164,,,,,,,,,,,,,0,,,,,T,terres,,,940,5.091987,44.895535
2019-311549,2019-07-15,000001,Vente,250000,295,,CHE DE LA TUBE,0011,26120,26081,Châteaudouble,26,,,26081000ZB0125,,,,,,,,,,,,,0,1,Maison,88,3,T,terres,,,3077,5.065543,44.905474
2019-311549,2019-07-15,000001,Vente,250000,295,,CHE DE LA TUBE,0011,26120,26081,Châteaudouble,26,,,26081000ZB0125,,,,,,,,,,,,,0,1,Maison,88,3,S,sols,,,2120,5.065543,44.905474
2019-311549,2019-07-15,000001,Vente,250000,295,,CHE DE LA TUBE,0011,26120,26081,Châteaudouble,26,,,26081000ZB0125,,,,,,,,,,,,,0,1,Maison,88,3,VE,vergers,,,710,5.065543,44.905474
2019-311549,2019-07-15,000001,Vente,250000,295,,CHE DE LA TUBE,0011,26120,26081,Châteaudouble,26,,,26081000ZB0125,,,,,,,,,,,,,0,1,Maison,88,3,T,terres,,,2840,5.065543,44.905474
2019-311637,2019-07-04,000001,Vente,5000,,,SEBRAN,B060,26120,26081,Châteaudouble,26,,,26081000ZE0047,,,,,,,,,,,,,0,,,,,T,terres,,,2140,5.092576,44.911813
2019-311637,2019-07-04,000001,Vente,5000,,,SEBRAN,B060,26120,26081,Châteaudouble,26,,,26081000ZE0047,,,,,,,,,,,,,0,,,,,T,terres,,,4280,5.092576,44.911813
2019-311804,2019-07-12,000001,Vente,12000,,,LES ALLEMANDS,B001,26120,26081,Châteaudouble,26,,,26081000ZD0023,,,,,,,,,,,,,0,,,,,T,terres,,,11760,5.070856,44.919907
2019-311804,2019-07-12,000001,Vente,12000,,,LES ALLEMANDS,B001,26120,26081,Châteaudouble,26,,,26081000ZD0050,,,,,,,,,,,,,0,,,,,S,sols,,,3045,5.072719,44.921844
2019-311804,2019-07-12,000001,Vente,12000,,,LES ALLEMANDS,B001,26120,26081,Châteaudouble,26,,,26081000ZD0050,,,,,,,,,,,,,0,,,,,T,terres,,,1700,5.072719,44.921844
2019-311804,2019-07-12,000001,Vente,12000,,,LES ALLEMANDS,B001,26120,26081,Châteaudouble,26,,,26081000ZD0050,,,,,,,,,,,,,0,,,,,BT,taillis simples,,,5510,5.072719,44.921844
2019-312251,2019-08-01,000001,Vente,270000,185,,CHE DE COTON,0003,26120,26081,Châteaudouble,26,,,260810000F0072,,,,,,,,,,,,,0,1,Maison,145,5,T,terres,,,1680,5.098292,44.898537
2019-312251,2019-08-01,000001,Vente,270000,185,,CHE DE COTON,0003,26120,26081,Châteaudouble,26,,,260810000F0072,,,,,,,,,,,,,0,1,Maison,145,5,S,sols,,,500,5.098292,44.898537
2019-312795,2019-08-14,000001,Vente,26000,,,LES SABLONS,B057,26120,26081,Châteaudouble,26,,,26081000ZB0068,,,,,,,,,,,,,0,,,,,T,terres,,,1860,5.06144,44.908148
2019-312795,2019-08-14,000001,Vente,26000,,,LES SABLONS,B057,26120,26081,Châteaudouble,26,,,26081000ZB0068,,,,,,,,,,,,,0,,,,,L,landes,PATUR,Pâture plantée,340,5.06144,44.908148
2019-312795,2019-08-14,000001,Vente,26000,,,LES SABLONS,B057,26120,26081,Châteaudouble,26,,,26081000ZB0069,,,,,,,,,,,,,0,,,,,BT,taillis simples,,,1320,5.06125,44.907982
2019-314587,2019-07-30,000001,Vente,183001,180,,CHE DU GRAND LIERNE,0033,26120,26081,Châteaudouble,26,,,26081000ZC0097,,,,,,,,,,,,,0,2,Appartement,85,4,S,sols,,,295,5.069967,44.912289
2019-314587,2019-07-30,000001,Vente,183001,,,GRAND LIERNE,B035,26120,26081,Châteaudouble,26,,,26081000ZC0101,,2,,,,,,,,,,,0,,,,,,,,,,5.070091,44.912237
2019-314824,2019-11-07,000001,Vente,83700,26,,RUE GRANDE RUE,0101,26120,26081,Châteaudouble,26,,,260810000C0357,,,,,,,,,,,,,0,1,Maison,46,2,S,sols,,,94,5.09506,44.899693
2019-314824,2019-11-07,000001,Vente,83700,,,LE VILLAGE,B068,26120,26081,Châteaudouble,26,,,260810000C0509,,,,,,,,,,,,,0,,,,,J,jardins,,,156,5.095105,44.899951
2019-314824,2019-11-07,000001,Vente,83700,,,LE VILLAGE,B068,26120,26081,Châteaudouble,26,,,260810000C0512,,,,,,,,,,,,,0,,,,,S,sols,,,66,5.095128,44.899763
2019-314824,2019-11-07,000001,Vente,83700,,,LE VILLAGE,B068,26120,26081,Châteaudouble,26,,,260810000C0546,,,,,,,,,,,,,0,,,,,S,sols,,,9,5.095122,44.899723
2019-314824,2019-11-07,000001,Vente,83700,,,LE VILLAGE,B068,26120,26081,Châteaudouble,26,,,260810000C0547,,,,,,,,,,,,,0,,,,,J,jardins,,,86,5.0952,44.900032
2019-316748,2019-12-20,000001,Vente,94985,245,,RTE DE GRENOUILLET,0110,26120,26081,Châteaudouble,26,,,26081000ZB0101,,,,,,,,,,,,,0,3,Dépendance,,0,S,sols,,,945,5.07313,44.905698
2019-316748,2019-12-20,000001,Vente,94985,245,,RTE DE GRENOUILLET,0110,26120,26081,Châteaudouble,26,,,26081000ZB0101,,,,,,,,,,,,,0,1,Maison,79,3,S,sols,,,945,5.07313,44.905698
2019-316748,2019-12-20,000001,Vente,94985,245,,RTE DE GRENOUILLET,0110,26120,26081,Châteaudouble,26,,,26081000ZB0101,,,,,,,,,,,,,0,3,Dépendance,,0,T,terres,,,2335,5.07313,44.905698
2019-316748,2019-12-20,000001,Vente,94985,245,,RTE DE GRENOUILLET,0110,26120,26081,Châteaudouble,26,,,26081000ZB0101,,,,,,,,,,,,,0,1,Maison,79,3,T,terres,,,2335,5.07313,44.905698
2019-316748,2019-12-20,000001,Vente,94985,,,LE GRENOUILLET,B037,26120,26081,Châteaudouble,26,,,26081000ZB0102,,,,,,,,,,,,,0,,,,,T,terres,,,1620,5.073649,44.905306
