id_mutation,date_mutation,numero_disposition,nature_mutation,valeur_fonciere,adresse_numero,adresse_suffixe,adresse_nom_voie,adresse_code_voie,code_postal,code_commune,nom_commune,code_departement,ancien_code_commune,ancien_nom_commune,id_parcelle,ancien_id_parcelle,numero_volume,lot1_numero,lot1_surface_carrez,lot2_numero,lot2_surface_carrez,lot3_numero,lot3_surface_carrez,lot4_numero,lot4_surface_carrez,lot5_numero,lot5_surface_carrez,nombre_lots,code_type_local,type_local,surface_reelle_bati,nombre_pieces_principales,code_nature_culture,nature_culture,code_nature_culture_speciale,nature_culture_speciale,surface_terrain,longitude,latitude
2019-330413,2019-02-19,000001,Vente,84500,210,,RTE DE PONT AUDEMER,0280,27680,27577,Sainte-Opportune-la-Mare,27,,,27577000AL0310,,,,,,,,,,,,,0,1,Maison,38,1,VE,vergers,,,2530,0.540557,49.412223
2019-330413,2019-02-19,000001,Vente,84500,210,,RTE DE PONT AUDEMER,0280,27680,27577,Sainte-Opportune-la-Mare,27,,,27577000AL0310,,,,,,,,,,,,,0,1,Maison,38,1,S,sols,,,500,0.540557,49.412223
2019-330509,2019-03-02,000001,Vente,30000,101,P,CHE DE LA BUQUETTERIE,0120,27680,27577,Sainte-Opportune-la-Mare,27,,,27577000ZD0098,,,,,,,,,,,,,0,1,Maison,40,2,S,sols,,,8,0.560628,49.408864
2019-330509,2019-03-02,000001,Vente,30000,,,CHE DE LA BUQUETTERIE,0120,27680,27577,Sainte-Opportune-la-Mare,27,,,27577000ZD0106,,,,,,,,,,,,,0,,,,,S,sols,,,69,0.560617,49.408912
2019-330509,2019-03-02,000001,Vente,30000,101,,CHE DE LA BUQUETTERIE,0120,27680,27577,Sainte-Opportune-la-Mare,27,,,27577000ZD0126,,,,,,,,,,,,,0,,,,,S,sols,,,192,0.560466,49.408904
2019-330621,2019-03-29,000001,Vente,490000,77,,RUE NOTRE CHIEN,0260,27680,27577,Sainte-Opportune-la-Mare,27,,,27577000AL0317,,,,,,,,,,,,,0,1,Maison,310,5,VE,vergers,,,4390,0.546493,49.419231
2019-330621,2019-03-29,000001,Vente,490000,77,,RUE NOTRE CHIEN,0260,27680,27577,Sainte-Opportune-la-Mare,27,,,27577000AL0317,,,,,,,,,,,,,0,1,Maison,310,5,S,sols,,,500,0.546493,49.419231
2019-330992,2019-06-11,000001,Vente,190000,280,,CHE DU BOIS DU ROY,0100,27680,27577,Sainte-Opportune-la-Mare,27,,,27577000AM0155,,,,,,,,,,,,,0,1,Maison,220,5,BT,taillis simples,,,11347,0.543249,49.420146
2019-330992,2019-06-11,000001,Vente,190000,280,,CHE DU BOIS DU ROY,0100,27680,27577,Sainte-Opportune-la-Mare,27,,,27577000AM0155,,,,,,,,,,,,,0,1,Maison,220,5,S,sols,,,500,0.543249,49.420146
2019-331085,2019-07-05,000001,Vente,89769,1700,,RTE DE QUILLEBEUF,0290,27680,27577,Sainte-Opportune-la-Mare,27,,,27577000AM0119,,,,,,,,,,,,,0,1,Maison,67,4,S,sols,,,766,0.546633,49.423206
2019-331085,2019-07-05,000001,Vente,89769,1700,,RTE DE QUILLEBEUF,0290,27680,27577,Sainte-Opportune-la-Mare,27,,,27577000AM0119,,,,,,,,,,,,,0,1,Maison,67,4,P,prés,,,797,0.546633,49.423206
2019-331670,2019-10-19,000001,Vente,118000,601,,RTE DE PONT AUDEMER,0280,27680,27577,Sainte-Opportune-la-Mare,27,,,27577000AM0150,,,,,,,,,,,,,0,1,Maison,52,3,S,sols,,,500,0.541884,49.415698
2019-331670,2019-10-19,000001,Vente,118000,601,,RTE DE PONT AUDEMER,0280,27680,27577,Sainte-Opportune-la-Mare,27,,,27577000AM0150,,,,,,,,,,,,,0,1,Maison,52,3,P,prés,,,1485,0.541884,49.415698
2019-332017,2019-12-20,000001,Vente,116000,710,,RTE DE PONT AUDEMER,0280,27680,27577,Sainte-Opportune-la-Mare,27,,,27577000AL0355,,,,,,,,,,,,,0,1,Maison,69,4,S,sols,,,278,0.543299,49.416114
