id_mutation,date_mutation,numero_disposition,nature_mutation,valeur_fonciere,adresse_numero,adresse_suffixe,adresse_nom_voie,adresse_code_voie,code_postal,code_commune,nom_commune,code_departement,ancien_code_commune,ancien_nom_commune,id_parcelle,ancien_id_parcelle,numero_volume,lot1_numero,lot1_surface_carrez,lot2_numero,lot2_surface_carrez,lot3_numero,lot3_surface_carrez,lot4_numero,lot4_surface_carrez,lot5_numero,lot5_surface_carrez,nombre_lots,code_type_local,type_local,surface_reelle_bati,nombre_pieces_principales,code_nature_culture,nature_culture,code_nature_culture_speciale,nature_culture_speciale,surface_terrain,longitude,latitude
2019-357709,2019-01-05,000001,Vente,100,,,MOULIN DE ROSSIOU,B041,29460,29086,Irvillac,29,,,29086000ZX0064,,,,,,,,,,,,,0,,,,,AB,terrains a bâtir,CHEM,Chemin (non groupe),3711,-4.203291,48.351422
2019-357828,2019-01-23,000001,Vente,30000,323,A,KERIVOAL,B025,29460,29086,Irvillac,29,,,29086000ZO0101,,,,,,,,,,,,,0,1,Maison,43,2,T,terres,,,1344,-4.158923,48.366368
2019-357828,2019-01-23,000001,Vente,30000,323,A,KERIVOAL,B025,29460,29086,Irvillac,29,,,29086000ZO0101,,,,,,,,,,,,,0,1,Maison,43,2,P,prés,,,4573,-4.158923,48.366368
2019-357832,2019-01-31,000001,Vente,131256,,,LE BOT,B062,29460,29086,Irvillac,29,,,29086000YD0030,,,,,,,,,,,,,0,,,,,S,sols,,,62,-4.238053,48.360084
2019-357832,2019-01-31,000001,Vente,131256,196,,LE BOT,B062,29460,29086,Irvillac,29,,,29086000YD0031,,,,,,,,,,,,,0,1,Maison,78,4,S,sols,,,235,-4.237965,48.360111
2019-357917,2019-01-29,000001,Vente,170000,5002,,CREACH CRIBIN,B010,29460,29086,Irvillac,29,,,29086000ZC0062,,,,,,,,,,,,,0,1,Maison,122,5,J,jardins,,,1728,-4.184918,48.384382
2019-357917,2019-01-29,000001,Vente,170000,5002,,CREACH CRIBIN,B010,29460,29086,Irvillac,29,,,29086000ZC0062,,,,,,,,,,,,,0,1,Maison,122,5,T,terres,,,13192,-4.184918,48.384382
2019-357917,2019-01-29,000001,Vente,170000,5002,,CREACH CRIBIN,B010,29460,29086,Irvillac,29,,,29086000ZC0062,,,,,,,,,,,,,0,1,Maison,122,5,S,sols,,,360,-4.184918,48.384382
2019-357917,2019-01-29,000001,Vente,170000,,,CREACH CRIBIN,B010,29460,29086,Irvillac,29,,,29086000ZC0069,,,,,,,,,,,,,0,,,,,T,terres,,,3586,-4.184374,48.38457
2019-358028,2019-02-01,000001,Vente,25000,16,,RTE DE HANVEC,0160,29460,29086,Irvillac,29,,,290860000I0305,,,,,,,,,,,,,0,1,Maison,76,2,S,sols,,,178,-4.212521,48.368836
2019-358028,2019-02-01,000001,Vente,25000,,,RTE DE HANVEC,0160,29460,29086,Irvillac,29,,,290860000I0909,,,,,,,,,,,,,0,,,,,J,jardins,,,74,-4.212385,48.368755
2019-358040,2019-02-09,000001,Vente,90000,,,CREACH CARNEL,B009,29460,29086,Irvillac,29,,,29086000ZX0055,,,,,,,,,,,,,0,,,,,T,terres,,,1580,-4.196221,48.35728
2019-358040,2019-02-09,000001,Vente,90000,,,CREACH CARNEL,B009,29460,29086,Irvillac,29,,,29086000ZX0158,,,,,,,,,,,,,0,,,,,S,sols,,,45,-4.196122,48.357276
2019-358040,2019-02-09,000001,Vente,90000,,,CREACH CARNEL,B009,29460,29086,Irvillac,29,,,29086000ZX0189,,,,,,,,,,,,,0,,,,,T,terres,,,43,-4.195998,48.357589
2019-358040,2019-02-09,000001,Vente,90000,272,,CREACH CARNEL,B009,29460,29086,Irvillac,29,,,29086000ZX0196,,,,,,,,,,,,,0,1,Maison,125,5,S,sols,,,201,-4.195953,48.35742
2019-358040,2019-02-09,000001,Vente,90000,,,CREACH CARNEL,B009,29460,29086,Irvillac,29,,,29086000ZX0197,,,,,,,,,,,,,0,,,,,S,sols,,,7,-4.195906,48.357314
2019-358040,2019-02-09,000001,Vente,90000,,,CREACH CARNEL,B009,29460,29086,Irvillac,29,,,29086000ZX0199,,,,,,,,,,,,,0,,,,,S,sols,,,170,-4.195996,48.357283
2019-358327,2019-03-20,000001,Vente,106107,24,,RTE DE LANDERNEAU,0180,29460,29086,Irvillac,29,,,29086000ZI0182,,,,,,,,,,,,,0,1,Maison,68,4,S,sols,,,326,-4.212561,48.37237
2019-358327,2019-03-20,000001,Vente,106107,,,RTE DE LANDERNEAU,0180,29460,29086,Irvillac,29,,,29086000ZI0318,,,,,,,,,,,,,0,,,,,S,sols,,,34,-4.212447,48.37233
2019-358474,2019-03-29,000002,Vente,10000,,,RUE DE LA VIERGE,0407,29460,29086,Irvillac,29,,,290860000I1089,,,,,,,,,,,,,0,,,,,T,terres,,,334,-4.213838,48.36871
2019-358490,2019-03-22,000001,Vente,4400,,,COATRIANT,B006,29460,29086,Irvillac,29,,,29086000ZN0051,,,,,,,,,,,,,0,,,,,T,terres,,,15608,-4.156775,48.37581
2019-358509,2019-04-05,000001,Vente,180000,4,,IMP VERDIERS,0406,29460,29086,Irvillac,29,,,29086000ZI0307,,,,,,,,,,,,,0,1,Maison,88,6,S,sols,,,500,-4.212235,48.371441
2019-358509,2019-04-05,000001,Vente,180000,4,,IMP VERDIERS,0406,29460,29086,Irvillac,29,,,29086000ZI0307,,,,,,,,,,,,,0,1,Maison,88,6,AG,terrains d'agrément,,,300,-4.212235,48.371441
2019-358586,2019-04-09,000001,Vente,80000,391,,GUERN BLOC'HON,B075,29460,29086,Irvillac,29,,,29086000ZI0208,,,,,,,,,,,,,0,1,Maison,81,3,S,sols,,,479,-4.197367,48.371924
2019-358586,2019-04-09,000001,Vente,80000,,,GUERN BLOC'HON,B075,29460,29086,Irvillac,29,,,29086000ZI0267,,,,,,,,,,,,,0,,,,,T,terres,,,49,-4.197568,48.372034
2019-358586,2019-04-09,000001,Vente,80000,,,GUERN BLOC'HON,B075,29460,29086,Irvillac,29,,,29086000ZI0268,,,,,,,,,,,,,0,,,,,T,terres,,,42,-4.197464,48.372078
2019-358586,2019-04-09,000001,Vente,80000,,,GUERN BLOC'HON,B075,29460,29086,Irvillac,29,,,29086000ZI0270,,,,,,,,,,,,,0,,,,,S,sols,,,132,-4.197444,48.371869
2019-358586,2019-04-09,000001,Vente,80000,,,GUERN BLOC'HON,B075,29460,29086,Irvillac,29,,,29086000ZI0346,,,,,,,,,,,,,0,,,,,S,sols,,,85,-4.197226,48.371782
2019-358586,2019-04-09,000001,Vente,80000,,,GUERN BLOC'HON,B075,29460,29086,Irvillac,29,,,29086000ZI0397,,,,,,,,,,,,,0,,,,,T,terres,,,8901,-4.197714,48.372315
2019-358692,2019-04-17,000001,Vente,107500,9,,RTE DE DAOULAS,0142,29460,29086,Irvillac,29,,,29086000ZW0053,,,,,,,,,,,,,0,,,,,S,sols,,,83,-4.21627,48.369142
2019-358692,2019-04-17,000001,Vente,107500,9,,RTE DE DAOULAS,0142,29460,29086,Irvillac,29,,,29086000ZW0115,,,,,,,,,,,,,0,1,Maison,84,3,S,sols,,,814,-4.216267,48.369304
2019-358901,2019-05-17,000001,Vente,145400,283,,MALANTY,B035,29460,29086,Irvillac,29,,,29086000ZV0080,,,,,,,,,,,,,0,3,Dépendance,,0,S,sols,,,559,-4.196714,48.362799
2019-358901,2019-05-17,000001,Vente,145400,283,,MALANTY,B035,29460,29086,Irvillac,29,,,29086000ZV0080,,,,,,,,,,,,,0,1,Maison,70,3,S,sols,,,559,-4.196714,48.362799
2019-358925,2019-02-08,000002,Echange,150,,,LE BOT,B062,29460,29086,Irvillac,29,,,29086000YD0151,,,,,,,,,,,,,0,,,,,S,sols,,,1,-4.23977,48.359889
2019-358925,2019-02-08,000002,Echange,150,,,LE BOT,B062,29460,29086,Irvillac,29,,,29086000YD0153,,,,,,,,,,,,,0,,,,,AG,terrains d'agrément,,,2,-4.239722,48.35981
2019-358925,2019-02-08,000003,Echange,150,,,LE BOT,B062,29460,29086,Irvillac,29,,,29086000YD0149,,,,,,,,,,,,,0,,,,,S,sols,,,3,-4.239835,48.359981
2019-358928,2019-05-24,000001,Vente,46300,,,RUE DU 16 AOUT 1944,0399,29460,29086,Irvillac,29,,,290860000I1063,,,,,,,,,,,,,0,,,,,P,prés,,,1128,-4.211941,48.369347
2019-358928,2019-05-24,000001,Vente,46300,,,RUE DU 16 AOUT 1944,0399,29460,29086,Irvillac,29,,,290860000I1065,,,,,,,,,,,,,0,,,,,S,sols,,,7,-4.212277,48.3694
2019-358928,2019-05-24,000001,Vente,46300,,,RUE DU 16 AOUT 1944,0399,29460,29086,Irvillac,29,,,290860000I1071,,,,,,,,,,,,,0,,,,,S,sols,,,8,-4.211879,48.369623
2019-358928,2019-05-24,000001,Vente,46300,10,,RUE DU 16 AOUT 1944,0399,29460,29086,Irvillac,29,,,290860000I1073,,,,,,,,,,,,,0,,,,,S,sols,,,24,-4.211809,48.369523
2019-359036,2019-05-17,000001,Vente,1500,,,LEURE,B090,29460,29086,Irvillac,29,,,29086000ZP0076,,,,,,,,,,,,,0,,,,,T,terres,,,2680,-4.202597,48.367143
2019-359124,2019-06-07,000001,Vente,144000,334,,GUILER,B019,29460,29086,Irvillac,29,,,29086000ZL0111,,,,,,,,,,,,,0,1,Maison,44,2,S,sols,,,74,-4.170479,48.377157
2019-359124,2019-06-07,000001,Vente,144000,334,,GUILER,B019,29460,29086,Irvillac,29,,,29086000ZL0113,,,,,,,,,,,,,0,1,Maison,109,6,S,sols,,,1000,-4.170475,48.376913
2019-359124,2019-06-07,000001,Vente,144000,334,,GUILER,B019,29460,29086,Irvillac,29,,,29086000ZL0113,,,,,,,,,,,,,0,1,Maison,109,6,T,terres,,,1260,-4.170475,48.376913
2019-359124,2019-06-07,000001,Vente,144000,,,GUILER,B019,29460,29086,Irvillac,29,,,29086000ZL0122,,,,,,,,,,,,,0,,,,,L,landes,,,1442,-4.170464,48.377034
2019-359124,2019-06-07,000001,Vente,144000,,,GUILER,B019,29460,29086,Irvillac,29,,,29086000ZL0125,,,,,,,,,,,,,0,,,,,S,sols,,,44,-4.169839,48.376947
2019-359452,2019-06-25,000001,Vente,44170,,,RTE DE LANDERNEAU,0180,29460,29086,Irvillac,29,,,29086000ZI0449,,,,,,,,,,,,,0,,,,,AB,terrains a bâtir,,,631,-4.211529,48.373287
2019-359503,2019-07-16,000001,Vente,140000,,,KERGAVAREC,B023,29460,29086,Irvillac,29,,,29086000ZS0098,,,,,,,,,,,,,0,,,,,S,sols,,,30,-4.171033,48.353956
2019-359503,2019-07-16,000001,Vente,140000,5204,,KERGAVAREC,B023,29460,29086,Irvillac,29,,,29086000ZS0099,,,,,,,,,,,,,0,1,Maison,80,4,S,sols,,,428,-4.171169,48.353889
2019-359503,2019-07-16,000001,Vente,140000,,,KERGAVAREC,B023,29460,29086,Irvillac,29,,,29086000ZS0191,,,,,,,,,,,,,0,,,,,S,sols,,,43,-4.17116,48.353851
2019-359509,2019-07-05,000001,Vente,67500,7,,RTE DU TREHOU,0400,29460,29086,Irvillac,29,,,29086000ZI0417,,,,,,,,,,,,,0,1,Maison,120,5,S,sols,,,500,-4.211726,48.371001
2019-359509,2019-07-05,000001,Vente,67500,7,,RTE DU TREHOU,0400,29460,29086,Irvillac,29,,,29086000ZI0417,,,,,,,,,,,,,0,1,Maison,120,5,AG,terrains d'agrément,,,1214,-4.211726,48.371001
2019-359514,2019-07-13,000001,Vente,191200,311,,MESMERC'HOU,B037,29460,29086,Irvillac,29,,,29086000ZO0135,,,,,,,,,,,,,0,1,Maison,80,3,VE,vergers,,,3533,-4.173036,48.359282
2019-359514,2019-07-13,000001,Vente,191200,311,,MESMERC'HOU,B037,29460,29086,Irvillac,29,,,29086000ZO0135,,,,,,,,,,,,,0,1,Maison,80,3,S,sols,,,943,-4.173036,48.359282
2019-359519,2019-07-16,000001,Vente,40000,4,,CHE DE POUL AR GOQUET,0215,29460,29086,Irvillac,29,,,290860000I1079,,,,,,,,,,,,,0,,,,,AB,terrains a bâtir,,,898,-4.209304,48.371122
2019-359692,2019-07-29,000001,Vente,309550,5198,,RTE DE ROSLAND,0306,29460,29086,Irvillac,29,,,29086000ZW0257,,,,,,,,,,,,,0,1,Maison,226,6,AG,terrains d'agrément,,,2131,-4.214083,48.366134
2019-359692,2019-07-29,000001,Vente,309550,5198,,RTE DE ROSLAND,0306,29460,29086,Irvillac,29,,,29086000ZW0257,,,,,,,,,,,,,0,1,Maison,226,6,S,sols,,,500,-4.214083,48.366134
2019-359692,2019-07-29,000001,Vente,309550,,,RTE DE ROSLAND,0306,29460,29086,Irvillac,29,,,29086000ZW0259,,,,,,,,,,,,,0,,,,,S,sols,,,31,-4.214293,48.366531
2019-359692,2019-07-29,000001,Vente,309550,,,RTE DE ROSLAND,0306,29460,29086,Irvillac,29,,,29086000ZW0260,,,,,,,,,,,,,0,,,,,S,sols,,,51,-4.214333,48.36657
2019-359873,2019-08-14,000001,Vente,142000,19,,RTE DE HANVEC,0160,29460,29086,Irvillac,29,,,290860000I0963,,,,,,,,,,,,,0,1,Maison,76,4,S,sols,,,515,-4.212351,48.369245
2019-359873,2019-08-14,000001,Vente,142000,,,RTE DE HANVEC,0160,29460,29086,Irvillac,29,,,290860000I0965,,,,,,,,,,,,,0,,,,,S,sols,,,79,-4.212542,48.369206
2019-360044,2019-08-09,000002,Vente,89350,,,RTE DE DAOULAS,0142,29460,29086,Irvillac,29,,,290860000I1101,,,,,,,,,,,,,0,,,,,J,jardins,,,47,-4.214126,48.369998
2019-360069,2019-08-20,000001,Vente,205000,,,LE BOT,B062,29460,29086,Irvillac,29,,,29086000YD0005,,,,,,,,,,,,,0,,,,,T,terres,,,480,,
2019-360069,2019-08-20,000001,Vente,205000,,,LE BOT,B062,29460,29086,Irvillac,29,,,29086000YD0006,,,,,,,,,,,,,0,,,,,S,sols,,,35,,
2019-360069,2019-08-20,000001,Vente,205000,,,LE BOT,B062,29460,29086,Irvillac,29,,,29086000YD0007,,,,,,,,,,,,,0,,,,,T,terres,,,680,,
2019-360069,2019-08-20,000001,Vente,205000,,,LE BOT,B062,29460,29086,Irvillac,29,,,29086000YD0008,,,,,,,,,,,,,0,,,,,T,terres,,,660,,
2019-360069,2019-08-20,000001,Vente,205000,,,LE BOT,B062,29460,29086,Irvillac,29,,,29086000YD0009,,,,,,,,,,,,,0,,,,,VE,vergers,,,49,,
2019-360069,2019-08-20,000001,Vente,205000,5194,,LE BOT,B062,29460,29086,Irvillac,29,,,29086000YD0135,,,,,,,,,,,,,0,1,Maison,103,6,S,sols,,,500,,
2019-360069,2019-08-20,000001,Vente,205000,5194,,LE BOT,B062,29460,29086,Irvillac,29,,,29086000YD0135,,,,,,,,,,,,,0,1,Maison,103,6,AG,terrains d'agrément,,,4500,,
2019-360145,2019-08-30,000001,Vente,3000,,,BODENES,B001,29460,29086,Irvillac,29,,,29086000ZS0045,,,,,,,,,,,,,0,,,,,P,prés,,,3620,-4.168843,48.34912
2019-360145,2019-08-30,000001,Vente,3000,,,CROAS DIBEN,B066,29460,29086,Irvillac,29,,,29086000ZS0134,,,,,,,,,,,,,0,,,,,P,prés,,,3549,-4.16974,48.355815
2019-360145,2019-08-30,000001,Vente,3000,,,CROAS DIBEN,B066,29460,29086,Irvillac,29,,,29086000ZS0134,,,,,,,,,,,,,0,,,,,L,landes,,,9000,-4.16974,48.355815
2019-360145,2019-08-30,000001,Vente,3000,,,CROAS DIBEN,B066,29460,29086,Irvillac,29,,,29086000ZS0134,,,,,,,,,,,,,0,,,,,T,terres,,,6000,-4.16974,48.355815
2019-360195,2019-08-27,000001,Vente,140000,12,,CHE DE POUL AR GOQUET,0215,29460,29086,Irvillac,29,,,290860000I0383,,,,,,,,,,,,,0,1,Maison,102,4,S,sols,,,365,-4.208573,48.371752
2019-360195,2019-08-27,000001,Vente,140000,,,CHE DE POUL AR GOQUET,0215,29460,29086,Irvillac,29,,,290860000I0384,,,,,,,,,,,,,0,,,,,T,terres,,,1080,-4.208302,48.371431
2019-360230,2019-09-14,000001,Vente,50000,,,PONT AR C'HLAN,B097,29460,29086,Irvillac,29,,,29086000ZI0427,,,,,,,,,,,,,0,,,,,AB,terrains a bâtir,,,813,-4.208521,48.368741
2019-360243,2019-09-04,000001,Vente,75000,8,,RTE DE LANDERNEAU,0180,29460,29086,Irvillac,29,,,29086000ZI0191,,,,,,,,,,,,,0,1,Maison,78,4,S,sols,,,130,-4.212634,48.370715
2019-360243,2019-09-04,000001,Vente,75000,,,CLECUNAN,B063,29460,29086,Irvillac,29,,,29086000ZI0289,,,,,,,,,,,,,0,,,,,T,terres,,,148,-4.212441,48.370701
2019-360243,2019-09-04,000001,Vente,75000,,,RTE DU TREHOU,0400,29460,29086,Irvillac,29,,,29086000ZI0292,,,,,,,,,,,,,0,,,,,S,sols,,,219,-4.212308,48.370617
2019-360529,2019-09-20,000001,Vente,89000,4,B,RUE DU 16 AOUT 1944,0399,29460,29086,Irvillac,29,,,290860000I0313,,,,,,,,,,,,,0,1,Maison,59,2,S,sols,,,68,-4.212341,48.369537
2019-360529,2019-09-20,000001,Vente,89000,4,B,RUE DU 16 AOUT 1944,0399,29460,29086,Irvillac,29,,,290860000I0314,,,,,,,,,,,,,0,,,,,S,sols,,,63,-4.212262,48.369535
2019-360620,2019-10-01,000001,Vente,155000,5032,,CITE DU BOT,A004,29460,29086,Irvillac,29,,,29086000YD0088,,,,,,,,,,,,,0,1,Maison,100,5,S,sols,,,995,-4.236055,48.361204
2019-360624,2019-10-02,000001,Vente,247000,5227,,CHS VOIE ROMAINE,0300,29460,29086,Irvillac,29,,,29086000ZW0285,,,,,,,,,,,,,0,1,Maison,110,5,S,sols,,,760,-4.212607,48.367291
2019-360629,2019-10-17,000001,Vente,137000,,,CREAC'H CRIBIN,B010,29460,29086,Irvillac,29,,,29086000ZC0093,,,,,,,,,,,,,0,,,,,S,sols,,,194,-4.182186,48.385207
2019-360629,2019-10-17,000001,Vente,137000,357,,CREAC'H CRIBIN,B010,29460,29086,Irvillac,29,,,29086000ZC0104,,,,,,,,,,,,,0,1,Maison,60,3,S,sols,,,1779,-4.182203,48.385442
2019-360629,2019-10-17,000001,Vente,137000,357,,CREAC'H CRIBIN,B010,29460,29086,Irvillac,29,,,29086000ZC0104,,,,,,,,,,,,,0,1,Maison,75,3,S,sols,,,1779,-4.182203,48.385442
2019-360629,2019-10-17,000001,Vente,137000,,,CREAC'H CRIBIN,B010,29460,29086,Irvillac,29,,,29086000ZC0113,,,,,,,,,,,,,0,,,,,AG,terrains d'agrément,,,499,-4.182306,48.385276
2019-360629,2019-10-17,000001,Vente,137000,,,CREAC'H CRIBIN,B010,29460,29086,Irvillac,29,,,29086000ZC0114,,,,,,,,,,,,,0,,,,,BR,futaies résineuses,,,95,-4.182359,48.385722
2019-360644,2019-10-09,000001,Vente,89000,,,CREAC'H CARNEL,B009,29460,29086,Irvillac,29,,,29086000ZX0056,,,,,,,,,,,,,0,,,,,T,terres,,,600,-4.198847,48.356609
2019-360644,2019-10-09,000001,Vente,89000,,,CREAC'H CARNEL,B009,29460,29086,Irvillac,29,,,29086000ZX0056,,,,,,,,,,,,,0,,,,,BF,futaies feuillues,,,64630,-4.198847,48.356609
2019-360816,2019-08-13,000001,Vente,99000,5,,RTE DE DAOULAS,0142,29460,29086,Irvillac,29,,,290860000I1053,,,,,,,,,,,,,0,,,,,S,sols,,,84,-4.214372,48.369857
2019-360816,2019-08-13,000001,Vente,99000,5,,RTE DE DAOULAS,0142,29460,29086,Irvillac,29,,,290860000I1098,,,,,,,,,,,,,0,1,Maison,69,3,S,sols,,,415,-4.214145,48.369794
2019-360816,2019-08-13,000001,Vente,99000,5,,RTE DE DAOULAS,0142,29460,29086,Irvillac,29,,,290860000I1098,,,,,,,,,,,,,0,1,Maison,113,7,S,sols,,,415,-4.214145,48.369794
2019-360816,2019-08-13,000001,Vente,99000,,,RTE DE DAOULAS,0142,29460,29086,Irvillac,29,,,290860000I1100,,,,,,,,,,,,,0,,,,,J,jardins,,,55,-4.214247,48.369953
2019-360952,2019-11-22,000001,Vente,271394.72,,,BODILER,B061,29460,29086,Irvillac,29,,,29086000ZS0011,,,,,,,,,,,,,0,,,,,BT,taillis simples,,,1180,-4.170723,48.350439
2019-360952,2019-11-22,000001,Vente,271394.72,,,BODILER,B061,29460,29086,Irvillac,29,,,29086000ZS0225,,,,,,,,,,,,,0,,,,,S,sols,,,27,-4.170473,48.349702
2019-360952,2019-11-22,000001,Vente,271394.72,5178,,BODILER,B061,29460,29086,Irvillac,29,,,29086000ZS0227,,,,,,,,,,,,,0,1,Maison,189,6,T,terres,,,5823,-4.171344,48.350283
2019-360952,2019-11-22,000001,Vente,271394.72,5178,,BODILER,B061,29460,29086,Irvillac,29,,,29086000ZS0227,,,,,,,,,,,,,0,1,Maison,63,2,S,sols,,,3123,-4.171344,48.350283
2019-360952,2019-11-22,000001,Vente,271394.72,5178,,BODILER,B061,29460,29086,Irvillac,29,,,29086000ZS0227,,,,,,,,,,,,,0,1,Maison,189,6,S,sols,,,3123,-4.171344,48.350283
2019-360952,2019-11-22,000001,Vente,271394.72,5178,,BODILER,B061,29460,29086,Irvillac,29,,,29086000ZS0227,,,,,,,,,,,,,0,1,Maison,63,2,P,prés,,,1914,-4.171344,48.350283
2019-360952,2019-11-22,000001,Vente,271394.72,5178,,BODILER,B061,29460,29086,Irvillac,29,,,29086000ZS0227,,,,,,,,,,,,,0,1,Maison,189,6,P,prés,,,1914,-4.171344,48.350283
2019-360952,2019-11-22,000001,Vente,271394.72,5178,,BODILER,B061,29460,29086,Irvillac,29,,,29086000ZS0227,,,,,,,,,,,,,0,1,Maison,63,2,BT,taillis simples,,,5000,-4.171344,48.350283
2019-360952,2019-11-22,000001,Vente,271394.72,5178,,BODILER,B061,29460,29086,Irvillac,29,,,29086000ZS0227,,,,,,,,,,,,,0,1,Maison,189,6,BT,taillis simples,,,5000,-4.171344,48.350283
2019-360952,2019-11-22,000001,Vente,271394.72,5178,,BODILER,B061,29460,29086,Irvillac,29,,,29086000ZS0227,,,,,,,,,,,,,0,1,Maison,63,2,T,terres,,,5823,-4.171344,48.350283
2019-360952,2019-11-22,000001,Vente,271394.72,5178,,BODILER,B061,29460,29086,Irvillac,29,,,29086000ZS0227,,,,,,,,,,,,,0,1,Maison,63,2,VE,vergers,,,2101,-4.171344,48.350283
2019-360952,2019-11-22,000001,Vente,271394.72,5178,,BODILER,B061,29460,29086,Irvillac,29,,,29086000ZS0227,,,,,,,,,,,,,0,1,Maison,189,6,VE,vergers,,,2101,-4.171344,48.350283
2019-360952,2019-11-22,000001,Vente,271394.72,,,BODILER,B061,29460,29086,Irvillac,29,,,29086000ZS0228,,,,,,,,,,,,,0,,,,,S,sols,,,271,-4.171036,48.349585
2019-360953,2019-11-22,000001,Vente,500,,,BODILER,B061,29460,29086,Irvillac,29,,,29086000ZS0231,,,,,,,,,,,,,0,,,,,S,sols,,,21,-4.171226,48.349503
2019-360953,2019-11-22,000001,Vente,500,,,BODILER,B061,29460,29086,Irvillac,29,,,29086000ZS0232,,,,,,,,,,,,,0,,,,,S,sols,,,42,-4.170735,48.34963
2019-361013,2019-11-14,000001,Vente,167000,18,,RTE DE HANVEC,0160,29460,29086,Irvillac,29,,,290860000I0705,,,,,,,,,,,,,0,1,Maison,98,5,S,sols,,,270,-4.212038,48.368383
2019-361013,2019-11-14,000001,Vente,167000,,,RTE DE HANVEC,0160,29460,29086,Irvillac,29,,,290860000I0910,,,,,,,,,,,,,0,,,,,T,terres,,,641,-4.212218,48.368558
2019-361022,2019-11-20,000001,Vente,25000,,,RTE DE LANDERNEAU,0180,29460,29086,Irvillac,29,,,29086000ZI0452,,,,,,,,,,,,,0,,,,,AB,terrains a bâtir,,,495,-4.212309,48.373401
2019-361294,2019-12-11,000001,Vente,53000,4,,RTE DU TREHOU,0400,29460,29086,Irvillac,29,,,290860000I0325,,,,,,,,,,,,,0,1,Maison,68,3,S,sols,,,217,-4.211984,48.370321
2019-361294,2019-12-11,000001,Vente,53000,4,,RTE DU TREHOU,0400,29460,29086,Irvillac,29,,,290860000I0936,,,,,,,,,,,,,0,,,,,J,jardins,,,352,-4.211869,48.370205
2019-361294,2019-12-11,000001,Vente,53000,4,,RTE DU TREHOU,0400,29460,29086,Irvillac,29,,,290860000I0936,,,,,,,,,,,,,0,,,,,S,sols,,,20,-4.211869,48.370205
2019-361302,2019-12-10,000001,Vente,51450,,,RTE DE LANDERNEAU,0180,29460,29086,Irvillac,29,,,29086000ZI0450,,,,,,,,,,,,,0,,,,,AB,terrains a bâtir,,,686,-4.211682,48.373489
2019-361322,2019-09-05,000001,Vente,125000,5049,,PENDREFF,B095,29460,29086,Irvillac,29,,,29086000ZE0118,,,,,,,,,,,,,0,1,Maison,98,5,S,sols,,,717,-4.196229,48.386976
2019-361322,2019-09-05,000001,Vente,125000,,,PENDREFF,B095,29460,29086,Irvillac,29,,,29086000ZE0120,,,,,,,,,,,,,0,,,,,S,sols,,,1350,-4.195686,48.387015
2019-361322,2019-09-05,000001,Vente,125000,,,PENDREFF,B095,29460,29086,Irvillac,29,,,29086000ZE0131,,,,,,,,,,,,,0,,,,,S,sols,,,472,-4.196108,48.38702
2019-361333,2019-12-14,000001,Vente,228650,11,,CHE DE PONT AR CHLAN,0200,29460,29086,Irvillac,29,,,29086000ZI0426,,,,,,,,,,,,,0,1,Maison,112,6,S,sols,,,790,-4.208777,48.368825
2019-361503,2019-12-28,000001,Vente,190000,246,,LAVADUR,B033,29460,29086,Irvillac,29,,,29086000ZY0242,,,,,,,,,,,,,0,1,Maison,107,5,S,sols,,,62,-4.221169,48.345522
2019-361503,2019-12-28,000001,Vente,190000,246,,LAVADUR,B033,29460,29086,Irvillac,29,,,29086000ZY0242,,,,,,,,,,,,,0,1,Maison,107,5,T,terres,,,615,-4.221169,48.345522
2019-361529,2019-12-19,000001,Vente,100000,15,,RUE DE LA VIERGE,0407,29460,29086,Irvillac,29,,,290860000I1029,,,,,,,,,,,,,0,1,Maison,85,3,S,sols,,,94,-4.214042,48.369114
2019-361529,2019-12-19,000001,Vente,100000,,,RUE DE LA VIERGE,0407,29460,29086,Irvillac,29,,,290860000I1030,,,,,,,,,,,,,0,,,,,S,sols,,,16,-4.214014,48.369174
2019-361529,2019-12-19,000001,Vente,100000,,,RUE DE LA VIERGE,0407,29460,29086,Irvillac,29,,,290860000I1033,,,,,,,,,,,,,0,,,,,L,landes,,,9,-4.214095,48.369134
2019-361563,2019-12-26,000001,Vente,162000,14,,RTE DE DAOULAS,0142,29460,29086,Irvillac,29,,,29086000YC0101,,,,,,,,,,,,,0,1,Maison,129,6,S,sols,,,410,-4.215043,48.369893
