id_mutation,date_mutation,numero_disposition,nature_mutation,valeur_fonciere,adresse_numero,adresse_suffixe,adresse_nom_voie,adresse_code_voie,code_postal,code_commune,nom_commune,code_departement,ancien_code_commune,ancien_nom_commune,id_parcelle,ancien_id_parcelle,numero_volume,lot1_numero,lot1_surface_carrez,lot2_numero,lot2_surface_carrez,lot3_numero,lot3_surface_carrez,lot4_numero,lot4_surface_carrez,lot5_numero,lot5_surface_carrez,nombre_lots,code_type_local,type_local,surface_reelle_bati,nombre_pieces_principales,code_nature_culture,nature_culture,code_nature_culture_speciale,nature_culture_speciale,surface_terrain,longitude,latitude
2019-361648,2019-01-17,000001,Vente,172500,12,,LOT GORRE KER,A015,29590,29139,Lopérec,29,,,291390000G0700,,,,,,,,,,,,,0,1,Maison,102,6,AG,terrains d'agrément,,,604,-4.050326,48.279348
2019-361648,2019-01-17,000001,Vente,172500,12,,LOT GORRE KER,A015,29590,29139,Lopérec,29,,,291390000G0700,,,,,,,,,,,,,0,1,Maison,102,6,S,sols,,,500,-4.050326,48.279348
2019-361805,2019-01-29,000001,Vente,136000,,,PONT LEURGARSTER,D091,29590,29139,Lopérec,29,,,291390000C0174,,,,,,,,,,,,,0,,,,,T,terres,,,4657,-4.001523,48.294297
2019-361805,2019-01-29,000001,Vente,136000,206,,PONT LEURGARSTER,D091,29590,29139,Lopérec,29,,,291390000E0001,,,,,,,,,,,,,0,1,Maison,157,3,S,sols,,,431,-4.001151,48.294399
2019-361805,2019-01-29,000001,Vente,136000,,,PONT LEURGARSTER,D091,29590,29139,Lopérec,29,,,291390000E0771,,,,,,,,,,,,,0,,,,,S,sols,,,300,-4.001205,48.294384
2019-361885,2019-01-31,000001,Vente,150000,5104,,RUE DE BRASPARTS,0664,29590,29139,Lopérec,29,,,29139000AB0362,,,4,,,,,,,,,,1,2,Appartement,71,4,,,,,,-4.047854,48.278044
2019-361885,2019-01-31,000001,Vente,150000,5104,,RUE DE BRASPARTS,0664,29590,29139,Lopérec,29,,,29139000AB0362,,,3,,,,,,,,,,1,2,Appartement,91,4,,,,,,-4.047854,48.278044
2019-361885,2019-01-31,000001,Vente,150000,5104,,RUE DE BRASPARTS,0664,29590,29139,Lopérec,29,,,29139000AB0362,,,2,,,,,,,,,,1,2,Appartement,57,3,,,,,,-4.047854,48.278044
2019-361885,2019-01-31,000001,Vente,150000,5104,,RUE DE BRASPARTS,0664,29590,29139,Lopérec,29,,,29139000AB0362,,,5,,,,,,,,,,1,2,Appartement,71,4,,,,,,-4.047854,48.278044
2019-361885,2019-01-31,000001,Vente,150000,5104,,RUE DE BRASPARTS,0664,29590,29139,Lopérec,29,,,29139000AB0362,,,1,,,,,,,,,,1,2,Appartement,92,4,,,,,,-4.047854,48.278044
2019-362164,2019-03-19,000001,Vente,100000,10,,RUE DE L ECOLE,0687,29590,29139,Lopérec,29,,,29139000AB0122,,,,,,,,,,,,,0,1,Maison,145,4,S,sols,,,209,-4.048826,48.276661
2019-362164,2019-03-19,000001,Vente,100000,,,LE BOURG,B049,29590,29139,Lopérec,29,,,29139000AB0252,,,,,,,,,,,,,0,,,,,S,sols,,,25,-4.048808,48.2767
2019-362564,2019-06-06,000001,Vente,85000,,,KROAS HENT KERVINIC,C455,29590,29139,Lopérec,29,,,291390000G0092,,,,,,,,,,,,,0,,,,,J,jardins,,,180,-4.051591,48.284381
2019-362564,2019-06-06,000001,Vente,85000,265,,KROAS HENT KERVINIC,C455,29590,29139,Lopérec,29,,,291390000G0096,,,,,,,,,,,,,0,1,Maison,70,3,S,sols,,,374,-4.05177,48.284698
2019-362649,2019-06-12,000001,Vente,20664,,,KERASCOET,B911,29590,29139,Lopérec,29,,,29139000AB0422,,,,,,,,,,,,,0,,,,,AB,terrains a bâtir,,,738,-4.05237,48.275726
2019-362649,2019-06-12,000001,Vente,20664,,,KERASCOET,B911,29590,29139,Lopérec,29,,,29139000AB0431,,,,,,,,,,,,,0,,,,,S,sols,,,102,-4.052213,48.275867
2019-362681,2019-06-14,000002,Vente,40000,,,COATSANTELAN,B290,29590,29139,Lopérec,29,,,291390000D0253,,,,,,,,,,,,,0,,,,,S,sols,,,1273,-4.028961,48.294393
2019-362681,2019-06-14,000002,Vente,40000,,,COATSANTELAN,B290,29590,29139,Lopérec,29,,,291390000D0255,,,,,,,,,,,,,0,,,,,J,jardins,,,210,-4.029157,48.294681
2019-362681,2019-06-14,000002,Vente,40000,192,,COATSANTELAN,B290,29590,29139,Lopérec,29,,,291390000D0256,,,,,,,,,,,,,0,1,Maison,66,2,S,sols,,,765,-4.029521,48.29462
2019-362681,2019-06-14,000002,Vente,40000,193,,COATSANTELAN,B290,29590,29139,Lopérec,29,,,291390000D0719,,,,,,,,,,,,,0,1,Maison,70,3,S,sols,,,64,-4.029319,48.294607
2019-362681,2019-06-14,000002,Vente,40000,,,COATSANTELAN,B290,29590,29139,Lopérec,29,,,291390000D0912,,,,,,,,,,,,,0,,,,,S,sols,,,732,-4.029278,48.294253
2019-362681,2019-06-14,000002,Vente,40000,,,COATSANTELAN,B290,29590,29139,Lopérec,29,,,291390000D0913,,,,,,,,,,,,,0,,,,,S,sols,,,163,-4.029364,48.294412
2019-362681,2019-06-14,000002,Vente,40000,,,COATSANTELAN,B290,29590,29139,Lopérec,29,,,291390000D1122,,,,,,,,,,,,,0,,,,,T,terres,,,2226,-4.028798,48.294643
2019-362755,2019-06-27,000001,Vente,8000,,,CREVEL,B370,29590,29139,Lopérec,29,,,291390000H0269,,,,,,,,,,,,,0,,,,,P,prés,,,16650,-4.048,48.295715
2019-362755,2019-06-27,000001,Vente,8000,,,CREVEL,B370,29590,29139,Lopérec,29,,,291390000H0270,,,,,,,,,,,,,0,,,,,BT,taillis simples,,,9364,-4.048063,48.295123
2019-362755,2019-06-27,000001,Vente,8000,,,CREVEL,B370,29590,29139,Lopérec,29,,,291390000H0271,,,,,,,,,,,,,0,,,,,T,terres,,,4000,-4.046741,48.294349
2019-362755,2019-06-27,000001,Vente,8000,,,CREVEL,B370,29590,29139,Lopérec,29,,,291390000H0272,,,,,,,,,,,,,0,,,,,L,landes,,,1760,-4.047416,48.294417
2019-362755,2019-06-27,000001,Vente,8000,,,CREVEL,B370,29590,29139,Lopérec,29,,,291390000H0273,,,,,,,,,,,,,0,,,,,T,terres,,,3897,-4.048011,48.294497
2019-362848,2019-07-05,000001,Vente,126500,1978,D,PEN AR HLEUZ,C833,29590,29139,Lopérec,29,,,29139000AB0219,,,,,,,,,,,,,0,1,Maison,98,5,T,terres,,,2040,-4.050759,48.277286
2019-362848,2019-07-05,000001,Vente,126500,1978,D,PEN AR HLEUZ,C833,29590,29139,Lopérec,29,,,29139000AB0219,,,,,,,,,,,,,0,1,Maison,98,5,S,sols,,,1000,-4.050759,48.277286
2019-363056,2019-08-05,000001,Vente,435260,,,PEN AR VOAS,C877,29590,29139,Lopérec,29,,,291390000F0124,,,,,,,,,,,,,0,,,,,VE,vergers,,,1699,-4.037809,48.266396
2019-363056,2019-08-05,000001,Vente,435260,,,PEN AR VOAS,C877,29590,29139,Lopérec,29,,,291390000F0126,,,,,,,,,,,,,0,,,,,S,sols,,,50,-4.037584,48.266632
2019-363056,2019-08-05,000001,Vente,435260,,,PEN AR VOAS,C877,29590,29139,Lopérec,29,,,291390000F0126,,,,,,,,,,,,,0,,,,,T,terres,,,1600,-4.037584,48.266632
2019-363056,2019-08-05,000001,Vente,435260,,,PEN AR VOAS,C877,29590,29139,Lopérec,29,,,291390000F0127,,,,,,,,,,,,,0,,,,,BT,taillis simples,,,378,-4.037077,48.267071
2019-363056,2019-08-05,000001,Vente,435260,,,PEN AR VOAS,C877,29590,29139,Lopérec,29,,,291390000F0563,,,,,,,,,,,,,0,,,,,S,sols,,,73,-4.0379,48.266373
2019-363056,2019-08-05,000001,Vente,435260,145,,PEN AR VOAS,C877,29590,29139,Lopérec,29,,,291390000F0824,,,,,,,,,,,,,0,1,Maison,274,6,S,sols,,,1431,-4.037831,48.266681
2019-363056,2019-08-05,000001,Vente,435260,145,,PEN AR VOAS,C877,29590,29139,Lopérec,29,,,291390000F0824,,,,,,,,,,,,,0,1,Maison,60,2,S,sols,,,1431,-4.037831,48.266681
2019-363056,2019-08-05,000001,Vente,435260,,,PEN AR VOAS,C877,29590,29139,Lopérec,29,,,291390000F0826,,,,,,,,,,,,,0,,,,,T,terres,,,340,-4.037322,48.267031
2019-363056,2019-08-05,000001,Vente,435260,,,PEN AR VOAS,C877,29590,29139,Lopérec,29,,,291390000F0828,,,,,,,,,,,,,0,,,,,S,sols,,,30,-4.037786,48.266921
2019-363212,2019-08-22,000001,Vente,5000,,,AR VENEC,B001,29590,29139,Lopérec,29,,,291390000E0486,,,,,,,,,,,,,0,,,,,T,terres,,,3673,-4.025702,48.275959
2019-363212,2019-08-22,000001,Vente,5000,,,AR VENEC,B001,29590,29139,Lopérec,29,,,291390000E0487,,,,,,,,,,,,,0,,,,,T,terres,,,8963,-4.025988,48.275472
2019-363212,2019-08-22,000001,Vente,5000,,,AR VENEC,B001,29590,29139,Lopérec,29,,,291390000E0492,,,,,,,,,,,,,0,,,,,L,landes,,,4704,-4.027148,48.274688
2019-363212,2019-08-22,000001,Vente,5000,,,AR VENEC,B001,29590,29139,Lopérec,29,,,291390000E0493,,,,,,,,,,,,,0,,,,,T,terres,,,9796,-4.027888,48.275179
2019-363244,2019-08-22,000002,Echange,7160,,,AR VENEC,B001,29590,29139,Lopérec,29,,,291390000E0903,,,,,,,,,,,,,0,,,,,T,terres,,,9905,-4.029084,48.278193
2019-363244,2019-08-22,000002,Echange,7160,,,AR VENEC,B001,29590,29139,Lopérec,29,,,291390000E0903,,,,,,,,,,,,,0,,,,,T,terres,,,9905,-4.029084,48.278193
2019-363244,2019-08-22,000002,Echange,7160,,,AR VENEC,B001,29590,29139,Lopérec,29,,,291390000E0903,,,,,,,,,,,,,0,,,,,S,sols,,,637,-4.029084,48.278193
2019-363244,2019-08-22,000003,Echange,7160,,,AR VENEC,B001,29590,29139,Lopérec,29,,,291390000E0492,,,,,,,,,,,,,0,,,,,L,landes,,,4704,-4.027148,48.274688
2019-363244,2019-08-22,000003,Echange,7160,,,AR VENEC,B001,29590,29139,Lopérec,29,,,291390000E0493,,,,,,,,,,,,,0,,,,,T,terres,,,9796,-4.027888,48.275179
2019-363379,2019-09-18,000001,Vente,150000,234,,KROAS HENT KERVEZ,C449,29590,29139,Lopérec,29,,,291390000H0099,,,,,,,,,,,,,0,1,Maison,80,3,S,sols,,,562,-4.029319,48.302323
2019-363379,2019-09-18,000001,Vente,150000,,,KROAS HENT KERVEZ,C449,29590,29139,Lopérec,29,,,291390000H0100,,,,,,,,,,,,,0,,,,,J,jardins,,,973,-4.02945,48.302461
2019-363379,2019-09-18,000001,Vente,150000,,,KROAS HENT KERVEZ,C449,29590,29139,Lopérec,29,,,291390000H0101,,,,,,,,,,,,,0,,,,,VE,vergers,,,1676,-4.029788,48.30224
2019-363379,2019-09-18,000001,Vente,150000,,,KROAS HENT KERVEZ,C449,29590,29139,Lopérec,29,,,291390000H0519,,,,,,,,,,,,,0,,,,,S,sols,,,140,-4.029655,48.302148
2019-363623,2019-10-11,000001,Vente,195000,156,,KLEGUER VRAS,B226,29590,29139,Lopérec,29,,,291390000F0027,,,,,,,,,,,,,0,1,Maison,94,4,S,sols,,,470,-4.026487,48.271005
2019-363623,2019-10-11,000001,Vente,195000,,,KLEGUER VRAS,B226,29590,29139,Lopérec,29,,,291390000F0028,,,,,,,,,,,,,0,,,,,BR,futaies résineuses,,,1828,-4.026155,48.270767
2019-363623,2019-10-11,000001,Vente,195000,,,KLEGUER VRAS,B226,29590,29139,Lopérec,29,,,291390000F0028,,,,,,,,,,,,,0,,,,,J,jardins,,,2040,-4.026155,48.270767
2019-363623,2019-10-11,000001,Vente,195000,,,KLEGUER VRAS,B226,29590,29139,Lopérec,29,,,291390000F0029,,,,,,,,,,,,,0,,,,,BR,futaies résineuses,,,754,-4.026375,48.2706
2019-363623,2019-10-11,000001,Vente,195000,,,KLEGUER VRAS,B226,29590,29139,Lopérec,29,,,291390000F0032,,,,,,,,,,,,,0,,,,,BR,futaies résineuses,,,969,-4.024338,48.270299
2019-363623,2019-10-11,000001,Vente,195000,,,KLEGUER VRAS,B226,29590,29139,Lopérec,29,,,291390000F0033,,,,,,,,,,,,,0,,,,,BR,futaies résineuses,,,3427,-4.023382,48.270175
2019-363623,2019-10-11,000001,Vente,195000,,,KLEGUER VRAS,B226,29590,29139,Lopérec,29,,,291390000F0034,,,,,,,,,,,,,0,,,,,BR,futaies résineuses,,,4428,-4.024129,48.270525
2019-363623,2019-10-11,000001,Vente,195000,,,KLEGUER VRAS,B226,29590,29139,Lopérec,29,,,291390000F0035,,,,,,,,,,,,,0,,,,,BR,futaies résineuses,,,5594,-4.02497,48.270665
2019-363760,2019-11-06,000001,Vente,130000,1,,LOT DE KREIZ DEIZ,A020,29590,29139,Lopérec,29,,,29139000AB0387,,,,,,,,,,,,,0,1,Maison,79,5,S,sols,,,846,-4.048185,48.278499
2019-363928,2019-11-21,000001,Vente,165000,,,DALGUERN,B422,29590,29139,Lopérec,29,,,291390000H0055,,,,,,,,,,,,,0,,,,,BT,taillis simples,,,5125,-4.035297,48.304896
2019-363928,2019-11-21,000001,Vente,165000,,,DALGUERN,B422,29590,29139,Lopérec,29,,,291390000H0056,,,,,,,,,,,,,0,,,,,T,terres,,,6260,-4.035368,48.30439
2019-363928,2019-11-21,000001,Vente,165000,,,DALGUERN,B422,29590,29139,Lopérec,29,,,291390000H0061,,,,,,,,,,,,,0,,,,,L,landes,,,3734,-4.034896,48.304052
2019-363928,2019-11-21,000001,Vente,165000,,,DALGUERN,B422,29590,29139,Lopérec,29,,,291390000H0062,,,,,,,,,,,,,0,,,,,T,terres,,,6170,-4.034326,48.304967
2019-363928,2019-11-21,000001,Vente,165000,5051,,DALGUERN,B422,29590,29139,Lopérec,29,,,291390000H0125,,,,,,,,,,,,,0,3,Dépendance,,0,T,terres,,,7611,-4.035843,48.301729
2019-363928,2019-11-21,000001,Vente,165000,5051,,DALGUERN,B422,29590,29139,Lopérec,29,,,291390000H0125,,,,,,,,,,,,,0,3,Dépendance,,0,S,sols,,,500,-4.035843,48.301729
2019-363928,2019-11-21,000001,Vente,165000,5050,,DALGUERN,B422,29590,29139,Lopérec,29,,,291390000H0127,,,,,,,,,,,,,0,4,Local industriel. commercial ou assimilé,22,0,S,sols,,,145,-4.036257,48.301988
2019-363928,2019-11-21,000001,Vente,165000,5050,,DALGUERN,B422,29590,29139,Lopérec,29,,,291390000H0127,,,,,,,,,,,,,0,3,Dépendance,,0,S,sols,,,145,-4.036257,48.301988
2019-363928,2019-11-21,000001,Vente,165000,5029,,DALGUERN,B422,29590,29139,Lopérec,29,,,291390000H0129,,,,,,,,,,,,,0,1,Maison,93,4,S,sols,,,61,-4.036578,48.301866
2019-363928,2019-11-21,000001,Vente,165000,,,DALGUERN,B422,29590,29139,Lopérec,29,,,291390000H0133,,,,,,,,,,,,,0,,,,,S,sols,,,32,-4.036512,48.301782
2019-363928,2019-11-21,000001,Vente,165000,,,DALGUERN,B422,29590,29139,Lopérec,29,,,291390000H0136,,,,,,,,,,,,,0,,,,,T,terres,,,7215,-4.035475,48.300845
2019-363928,2019-11-21,000001,Vente,165000,,,DALGUERN,B422,29590,29139,Lopérec,29,,,291390000H0137,,,,,,,,,,,,,0,,,,,VE,vergers,,,1525,-4.034862,48.30137
2019-363928,2019-11-21,000001,Vente,165000,,,DALGUERN,B422,29590,29139,Lopérec,29,,,291390000H0438,,,,,,,,,,,,,0,,,,,T,terres,,,140,-4.036339,48.30166
2019-364223,2019-12-28,000001,Vente,95000,173,,VERIDY,D548,29590,29139,Lopérec,29,,,291390000D0073,,,,,,,,,,,,,0,1,Maison,96,4,S,sols,,,1950,-4.01125,48.290623
2019-364223,2019-12-28,000001,Vente,95000,,,VERIDY,D548,29590,29139,Lopérec,29,,,291390000D0878,,,,,,,,,,,,,0,,,,,T,terres,,,1564,-4.011553,48.290582
