id_mutation,date_mutation,numero_disposition,nature_mutation,valeur_fonciere,adresse_numero,adresse_suffixe,adresse_nom_voie,adresse_code_voie,code_postal,code_commune,nom_commune,code_departement,ancien_code_commune,ancien_nom_commune,id_parcelle,ancien_id_parcelle,numero_volume,lot1_numero,lot1_surface_carrez,lot2_numero,lot2_surface_carrez,lot3_numero,lot3_surface_carrez,lot4_numero,lot4_surface_carrez,lot5_numero,lot5_surface_carrez,nombre_lots,code_type_local,type_local,surface_reelle_bati,nombre_pieces_principales,code_nature_culture,nature_culture,code_nature_culture_speciale,nature_culture_speciale,surface_terrain,longitude,latitude
2019-357615,2019-11-21,000001,Vente,346500,,,LANHERIC,B056,29410,29202,Plounéour-Ménez,29,,,292020000B0113,,,,,,,,,,,,,0,,,,,T,terres,,,7450,-3.899763,48.470042
2019-357615,2019-11-21,000001,Vente,346500,633,,LANHERIC,B056,29410,29202,Plounéour-Ménez,29,,,292020000B0130,,,,,,,,,,,,,0,3,Dépendance,,0,S,sols,,,1620,-3.89606,48.470945
2019-357615,2019-11-21,000001,Vente,346500,633,,LANHERIC,B056,29410,29202,Plounéour-Ménez,29,,,292020000B0130,,,,,,,,,,,,,0,1,Maison,248,8,S,sols,,,1620,-3.89606,48.470945
2019-357615,2019-11-21,000001,Vente,346500,633,,LANHERIC,B056,29410,29202,Plounéour-Ménez,29,,,292020000B0130,,,,,,,,,,,,,0,3,Dépendance,,0,S,sols,,,1620,-3.89606,48.470945
2019-357615,2019-11-21,000001,Vente,346500,633,,LANHERIC,B056,29410,29202,Plounéour-Ménez,29,,,292020000B0130,,,,,,,,,,,,,0,3,Dépendance,,0,S,sols,,,1620,-3.89606,48.470945
2019-357615,2019-11-21,000001,Vente,346500,,,LANHERIC,B056,29410,29202,Plounéour-Ménez,29,,,292020000B0131,,,,,,,,,,,,,0,,,,,J,jardins,,,816,-3.896232,48.471265
2019-357615,2019-11-21,000001,Vente,346500,,,LANHERIC,B056,29410,29202,Plounéour-Ménez,29,,,292020000B0132,,,,,,,,,,,,,0,,,,,T,terres,,,2197,-3.896587,48.470885
2019-357615,2019-11-21,000001,Vente,346500,,,LANHERIC,B056,29410,29202,Plounéour-Ménez,29,,,292020000B0133,,,,,,,,,,,,,0,,,,,BR,futaies résineuses,,,4630,-3.897173,48.470872
2019-357615,2019-11-21,000001,Vente,346500,,,LANHERIC,B056,29410,29202,Plounéour-Ménez,29,,,292020000B0134,,,,,,,,,,,,,0,,,,,T,terres,,,5320,-3.898359,48.470247
2019-357615,2019-11-21,000001,Vente,346500,,,LANHERIC,B056,29410,29202,Plounéour-Ménez,29,,,292020000B0139,,,,,,,,,,,,,0,,,,,P,prés,,,1180,-3.899774,48.471394
2019-357615,2019-11-21,000001,Vente,346500,,,LANHERIC,B056,29410,29202,Plounéour-Ménez,29,,,292020000B0140,,,,,,,,,,,,,0,,,,,L,landes,,,320,-3.89942,48.471464
2019-357615,2019-11-21,000001,Vente,346500,,,LANHERIC,B056,29410,29202,Plounéour-Ménez,29,,,292020000B0141,,,,,,,,,,,,,0,,,,,P,prés,,,3317,-3.898947,48.471856
2019-357615,2019-11-21,000001,Vente,346500,,,LANHERIC,B056,29410,29202,Plounéour-Ménez,29,,,292020000B0142,,,,,,,,,,,,,0,,,,,P,prés,,,2278,-3.898105,48.472583
2019-357615,2019-11-21,000001,Vente,346500,,,LANHERIC,B056,29410,29202,Plounéour-Ménez,29,,,292020000B0143,,,,,,,,,,,,,0,,,,,BT,taillis simples,,,590,-3.897848,48.472546
2019-357615,2019-11-21,000001,Vente,346500,,,LANHERIC,B056,29410,29202,Plounéour-Ménez,29,,,292020000B0144,,,,,,,,,,,,,0,,,,,BR,futaies résineuses,,,2550,-3.897658,48.472514
2019-357615,2019-11-21,000001,Vente,346500,,,LANHERIC,B056,29410,29202,Plounéour-Ménez,29,,,292020000B0146,,,,,,,,,,,,,0,,,,,BR,futaies résineuses,,,700,-3.898384,48.471842
2019-357615,2019-11-21,000001,Vente,346500,,,LANHERIC,B056,29410,29202,Plounéour-Ménez,29,,,292020000B0147,,,,,,,,,,,,,0,,,,,BR,futaies résineuses,,,730,-3.898476,48.471673
2019-357615,2019-11-21,000001,Vente,346500,,,LANHERIC,B056,29410,29202,Plounéour-Ménez,29,,,292020000B0148,,,,,,,,,,,,,0,,,,,BR,futaies résineuses,,,1399,-3.898792,48.471487
2019-357615,2019-11-21,000001,Vente,346500,,,LANHERIC,B056,29410,29202,Plounéour-Ménez,29,,,292020000B0149,,,,,,,,,,,,,0,,,,,L,landes,,,480,-3.898149,48.471491
2019-357615,2019-11-21,000001,Vente,346500,,,LANHERIC,B056,29410,29202,Plounéour-Ménez,29,,,292020000B0150,,,,,,,,,,,,,0,,,,,BR,futaies résineuses,,,4900,-3.897719,48.471688
2019-357615,2019-11-21,000001,Vente,346500,,,LANHERIC,B056,29410,29202,Plounéour-Ménez,29,,,292020000B0155,,,,,,,,,,,,,0,,,,,VE,vergers,,,2945,-3.895709,48.471391
2019-357615,2019-11-21,000001,Vente,346500,,,LANHERIC,B056,29410,29202,Plounéour-Ménez,29,,,292020000B0156,,,,,,,,,,,,,0,,,,,T,terres,,,7896,-3.895136,48.472298
2019-357615,2019-11-21,000001,Vente,346500,,,LANHERIC,B056,29410,29202,Plounéour-Ménez,29,,,292020000B0157,,,,,,,,,,,,,0,,,,,T,terres,,,1920,-3.894721,48.472995
2019-357615,2019-11-21,000001,Vente,346500,,,LANHERIC,B056,29410,29202,Plounéour-Ménez,29,,,292020000B0158,,,,,,,,,,,,,0,,,,,T,terres,,,2640,-3.895385,48.472911
2019-357615,2019-11-21,000001,Vente,346500,,,LANHERIC,B056,29410,29202,Plounéour-Ménez,29,,,292020000B0159,,,,,,,,,,,,,0,,,,,T,terres,,,10160,-3.896211,48.472697
2019-357615,2019-11-21,000001,Vente,346500,,,LANHERIC,B056,29410,29202,Plounéour-Ménez,29,,,292020000B0160,,,,,,,,,,,,,0,,,,,T,terres,,,2520,-3.896218,48.473306
2019-357615,2019-11-21,000001,Vente,346500,,,LANHERIC,B056,29410,29202,Plounéour-Ménez,29,,,292020000B0161,,,,,,,,,,,,,0,,,,,T,terres,,,3550,-3.896997,48.473126
2019-357615,2019-11-21,000001,Vente,346500,,,LANHERIC,B056,29410,29202,Plounéour-Ménez,29,,,292020000B0162,,,,,,,,,,,,,0,,,,,P,prés,,,2090,-3.897423,48.473341
2019-357615,2019-11-21,000001,Vente,346500,,,LANHERIC,B056,29410,29202,Plounéour-Ménez,29,,,292020000B0163,,,,,,,,,,,,,0,,,,,BR,futaies résineuses,,,10730,-3.896014,48.473736
2019-357615,2019-11-21,000001,Vente,346500,,,LANHERIC,B056,29410,29202,Plounéour-Ménez,29,,,292020000B0164,,,,,,,,,,,,,0,,,,,BR,futaies résineuses,,,4110,-3.896438,48.474547
2019-357615,2019-11-21,000001,Vente,346500,,,LANHERIC,B056,29410,29202,Plounéour-Ménez,29,,,292020000B0165,,,,,,,,,,,,,0,,,,,BR,futaies résineuses,,,6985,-3.89584,48.474375
2019-357615,2019-11-21,000001,Vente,346500,,,LANHERIC,B056,29410,29202,Plounéour-Ménez,29,,,292020000B0166,,,,,,,,,,,,,0,,,,,BR,futaies résineuses,,,3220,-3.89503,48.473812
2019-357615,2019-11-21,000001,Vente,346500,,,LANHERIC,B056,29410,29202,Plounéour-Ménez,29,,,292020000B0167,,,,,,,,,,,,,0,,,,,BR,futaies résineuses,,,5785,-3.894578,48.474766
2019-357615,2019-11-21,000001,Vente,346500,,,LANHERIC,B056,29410,29202,Plounéour-Ménez,29,,,292020000B0178,,,,,,,,,,,,,0,,,,,BR,futaies résineuses,,,4180,-3.893719,48.474561
2019-357615,2019-11-21,000001,Vente,346500,,,LANHERIC,B056,29410,29202,Plounéour-Ménez,29,,,292020000B0179,,,,,,,,,,,,,0,,,,,BR,futaies résineuses,,,1950,-3.893199,48.474327
2019-357615,2019-11-21,000001,Vente,346500,,,LANHERIC,B056,29410,29202,Plounéour-Ménez,29,,,292020000B0181,,,,,,,,,,,,,0,,,,,BT,taillis simples,,,6456,-3.894341,48.473563
2019-357615,2019-11-21,000001,Vente,346500,,,LANHERIC,B056,29410,29202,Plounéour-Ménez,29,,,292020000B0182,,,,,,,,,,,,,0,,,,,BR,futaies résineuses,,,4664,-3.893795,48.473297
2019-357615,2019-11-21,000001,Vente,346500,,,LANHERIC,B056,29410,29202,Plounéour-Ménez,29,,,292020000B0183,,,,,,,,,,,,,0,,,,,BR,futaies résineuses,,,4380,-3.89413,48.47283
2019-357615,2019-11-21,000001,Vente,346500,,,LANHERIC,B056,29410,29202,Plounéour-Ménez,29,,,292020000B0184,,,,,,,,,,,,,0,,,,,BR,futaies résineuses,,,5844,-3.894494,48.472153
2019-357615,2019-11-21,000001,Vente,346500,633,C,LANHERIC,B056,29410,29202,Plounéour-Ménez,29,,,292020000B0186,,,,,,,,,,,,,0,3,Dépendance,,0,T,terres,,,3910,-3.894652,48.471358
2019-357615,2019-11-21,000001,Vente,346500,,,LANHERIC,B056,29410,29202,Plounéour-Ménez,29,,,292020000B0187,,,,,,,,,,,,,0,,,,,S,sols,,,270,-3.89529,48.471021
2019-357615,2019-11-21,000001,Vente,346500,,,LANHERIC,B056,29410,29202,Plounéour-Ménez,29,,,292020000B0188,,,,,,,,,,,,,0,,,,,T,terres,,,6673,-3.894979,48.470655
2019-357615,2019-11-21,000001,Vente,346500,,,LANHERIC,B056,29410,29202,Plounéour-Ménez,29,,,292020000B1303,,,,,,,,,,,,,0,,,,,S,sols,,,109,-3.896272,48.470901
2019-357615,2019-11-21,000001,Vente,346500,,,GARSPLEGEANT,B021,29410,29202,Plounéour-Ménez,29,,,292020000C0091,,,,,,,,,,,,,0,,,,,L,landes,,,445,-3.891251,48.470336
2019-357615,2019-11-21,000001,Vente,346500,,,GARSPLEGEANT,B021,29410,29202,Plounéour-Ménez,29,,,292020000C0094,,,,,,,,,,,,,0,,,,,BR,futaies résineuses,,,2250,-3.893878,48.470934
2019-357615,2019-11-21,000001,Vente,346500,,,GARSPLEGEANT,B021,29410,29202,Plounéour-Ménez,29,,,292020000C1165,,,,,,,,,,,,,0,,,,,BR,futaies résineuses,,,11175,-3.892952,48.47044
2019-364511,2019-01-18,000001,Vente,82000,18,,RUE JEAN MOULIN,1000,29410,29202,Plounéour-Ménez,29,,,29202000AE0017,,,,,,,,,,,,,0,1,Maison,83,5,S,sols,,,372,-3.89074,48.440744
2019-364643,2019-01-24,000001,Vente,37400,,,GRINEC,B026,29410,29202,Plounéour-Ménez,29,,,292020000E0095,,,,,,,,,,,,,0,,,,,J,jardins,,,397,-3.842824,48.466033
2019-364643,2019-01-24,000001,Vente,37400,423,B,GRINEC,B026,29410,29202,Plounéour-Ménez,29,,,292020000E0748,,,,,,,,,,,,,0,1,Maison,96,4,S,sols,,,129,-3.84229,48.466263
2019-364643,2019-01-24,000001,Vente,37400,,,GRINEC,B026,29410,29202,Plounéour-Ménez,29,,,292020000E0805,,,,,,,,,,,,,0,,,,,VE,vergers,,,1043,-3.842575,48.465923
2019-364643,2019-01-24,000001,Vente,37400,,,GRINEC,B026,29410,29202,Plounéour-Ménez,29,,,292020000E0808,,,,,,,,,,,,,0,,,,,S,sols,,,148,-3.842383,48.466177
2019-364703,2019-02-01,000001,Vente,55000,,,GUERNOSBIAN,B029,29410,29202,Plounéour-Ménez,29,,,292020000L0780,,,,,,,,,,,,,0,,,,,S,sols,,,77,-3.928181,48.441464
2019-364703,2019-02-01,000001,Vente,55000,,,GUERNOSBIAN,B029,29410,29202,Plounéour-Ménez,29,,,292020000L0848,,,,,,,,,,,,,0,,,,,S,sols,,,39,-3.927884,48.441273
2019-364703,2019-02-01,000001,Vente,55000,621,,GUERNOSBIAN,B029,29410,29202,Plounéour-Ménez,29,,,292020000L1125,,,,,,,,,,,,,0,1,Maison,120,4,S,sols,,,1052,-3.928047,48.441674
2019-364705,2019-02-12,000004,Vente,4000,,,COAT MALGUEN,B012,29410,29202,Plounéour-Ménez,29,,,292020000C0816,,,,,,,,,,,,,0,,,,,L,landes,,,2353,-3.883589,48.44898
2019-364714,2019-02-06,000001,Vente,100000,,,LA CASERNE,B007,29410,29202,Plounéour-Ménez,29,,,29202000AH0004,,,,,,,,,,,,,0,,,,,S,sols,,,26,-3.884939,48.441009
2019-364714,2019-02-06,000001,Vente,100000,5188,,RUE DES MONTS D ARREE,1320,29410,29202,Plounéour-Ménez,29,,,29202000AH0005,,,,,,,,,,,,,0,,,,,S,sols,,,29,-3.884892,48.441018
2019-364714,2019-02-06,000001,Vente,100000,,,LA CASERNE,B007,29410,29202,Plounéour-Ménez,29,,,29202000AH0006,,,,,,,,,,,,,0,,,,,S,sols,,,1068,-3.884653,48.440886
2019-364714,2019-02-06,000001,Vente,100000,1990,A,LA CASERNE,B007,29410,29202,Plounéour-Ménez,29,,,29202000AH0007,,,,,,,,,,,,,0,1,Maison,73,3,J,jardins,,,860,-3.884948,48.440781
2019-364733,2019-02-13,000001,Vente,42000,,,L ILLE,B060,29410,29202,Plounéour-Ménez,29,,,292020000K0540,,,,,,,,,,,,,0,,,,,S,sols,,,69,-3.890691,48.444133
2019-364733,2019-02-13,000001,Vente,42000,374,A,L ILLE,B060,29410,29202,Plounéour-Ménez,29,,,292020000K0542,,,,,,,,,,,,,0,1,Maison,80,5,S,sols,,,892,-3.890546,48.44423
2019-364838,2019-02-28,000001,Vente,31550,,,TRAON STANG,B127,29410,29202,Plounéour-Ménez,29,,,292020000C0187,,,,,,,,,,,,,0,,,,,P,prés,,,1260,-3.883958,48.470903
2019-364838,2019-02-28,000001,Vente,31550,,,TRAON STANG,B127,29410,29202,Plounéour-Ménez,29,,,292020000C0188,,,,,,,,,,,,,0,,,,,P,prés,,,1890,-3.883261,48.470408
2019-364838,2019-02-28,000001,Vente,31550,,,TRAON STANG,B127,29410,29202,Plounéour-Ménez,29,,,292020000C0189,,,,,,,,,,,,,0,,,,,T,terres,,,2662,-3.883165,48.469996
2019-364838,2019-02-28,000001,Vente,31550,6997,A,TRAON STANG,B127,29410,29202,Plounéour-Ménez,29,,,292020000C0192,,,,,,,,,,,,,0,1,Maison,75,3,S,sols,,,605,-3.883937,48.469734
2019-364838,2019-02-28,000001,Vente,31550,6997,A,TRAON STANG,B127,29410,29202,Plounéour-Ménez,29,,,292020000C0192,,,,,,,,,,,,,0,1,Maison,75,3,J,jardins,,,1605,-3.883937,48.469734
2019-364855,2019-02-19,000001,Vente,120000,,,GUERNIGOU,B028,29410,29202,Plounéour-Ménez,29,,,292020000K0390,,,,,,,,,,,,,0,,,,,J,jardins,,,557,-3.91202,48.4379
2019-364855,2019-02-19,000001,Vente,120000,,,GUERNIGOU,B028,29410,29202,Plounéour-Ménez,29,,,292020000K0393,,,,,,,,,,,,,0,,,,,S,sols,,,20,-3.912224,48.437641
2019-364855,2019-02-19,000001,Vente,120000,,,GUERNIGOU,B028,29410,29202,Plounéour-Ménez,29,,,292020000K0560,,,,,,,,,,,,,0,,,,,T,terres,,,38,-3.91216,48.437665
2019-364855,2019-02-19,000001,Vente,120000,608,,GUERNIGOU,B028,29410,29202,Plounéour-Ménez,29,,,292020000K0575,,,,,,,,,,,,,0,1,Maison,106,3,S,sols,,,1033,-3.911885,48.437715
2019-364920,2019-02-25,000001,Vente,1600,,,ROSCAD,B109,29410,29202,Plounéour-Ménez,29,,,292020000I0335,,,,,,,,,,,,,0,,,,,T,terres,,,8000,-3.895521,48.427778
2019-364940,2019-02-16,000001,Vente,37000,,,ROZ AR YAR,B112,29410,29202,Plounéour-Ménez,29,,,292020000F1160,,,,,,,,,,,,,0,,,,,AB,terrains a bâtir,,,992,-3.880044,48.447257
2019-364940,2019-02-16,000001,Vente,37000,,,ROZ AR YAR,B112,29410,29202,Plounéour-Ménez,29,,,292020000F1161,,,,,,,,,,,,,0,,,,,AB,terrains a bâtir,,,999,-3.879738,48.447008
2019-364948,2019-03-08,000001,Vente,121000,5,,RUE DE LA LIBERATION,1200,29410,29202,Plounéour-Ménez,29,,,29202000AE0365,,,,,,,,,,,,,0,2,Appartement,74,5,S,sols,,,436,-3.887737,48.439839
2019-364948,2019-03-08,000001,Vente,121000,5,,RUE DE LA LIBERATION,1200,29410,29202,Plounéour-Ménez,29,,,29202000AE0365,,,,,,,,,,,,,0,2,Appartement,41,2,S,sols,,,436,-3.887737,48.439839
2019-364948,2019-03-08,000001,Vente,121000,5,,RUE DE LA LIBERATION,1200,29410,29202,Plounéour-Ménez,29,,,29202000AE0365,,,,,,,,,,,,,0,2,Appartement,67,3,S,sols,,,436,-3.887737,48.439839
2019-364948,2019-03-08,000001,Vente,121000,5,,RUE DE LA LIBERATION,1200,29410,29202,Plounéour-Ménez,29,,,29202000AE0365,,,,,,,,,,,,,0,2,Appartement,45,2,S,sols,,,436,-3.887737,48.439839
2019-364948,2019-03-08,000001,Vente,121000,5,,RUE DE LA LIBERATION,1200,29410,29202,Plounéour-Ménez,29,,,29202000AE0365,,,,,,,,,,,,,0,2,Appartement,62,4,S,sols,,,436,-3.887737,48.439839
2019-364948,2019-03-08,000001,Vente,121000,5,,RUE DE LA LIBERATION,1200,29410,29202,Plounéour-Ménez,29,,,29202000AE0365,,,,,,,,,,,,,0,3,Dépendance,,0,S,sols,,,436,-3.887737,48.439839
2019-364948,2019-03-08,000001,Vente,121000,7,,RUE DE LA LIBERATION,1200,29410,29202,Plounéour-Ménez,29,,,29202000AE0371,,,,,,,,,,,,,0,,,,,S,sols,,,74,-3.887641,48.439742
2019-364967,2019-03-12,000001,Vente,45000,,,CLOSTROU,B011,29410,29202,Plounéour-Ménez,29,,,292020000C0238,,,,,,,,,,,,,0,,,,,T,terres,,,6287,-3.879212,48.468078
2019-364967,2019-03-12,000001,Vente,45000,,,CLOSTROU,B011,29410,29202,Plounéour-Ménez,29,,,292020000C0239,,,,,,,,,,,,,0,,,,,T,terres,,,8633,-3.880701,48.467928
2019-364967,2019-03-12,000001,Vente,45000,,,CLOSTROU,B011,29410,29202,Plounéour-Ménez,29,,,292020000C0240,,,,,,,,,,,,,0,,,,,BT,taillis simples,,,1517,-3.880438,48.46744
2019-364967,2019-03-12,000001,Vente,45000,,,CLOSTROU,B011,29410,29202,Plounéour-Ménez,29,,,292020000C0241,,,,,,,,,,,,,0,,,,,T,terres,,,8372,-3.880125,48.467081
2019-364967,2019-03-12,000001,Vente,45000,,,CLOSTROU,B011,29410,29202,Plounéour-Ménez,29,,,292020000C0242,,,,,,,,,,,,,0,,,,,BT,taillis simples,,,599,-3.881008,48.466995
2019-364967,2019-03-12,000001,Vente,45000,,,CLOSTROU,B011,29410,29202,Plounéour-Ménez,29,,,292020000C0243,,,,,,,,,,,,,0,,,,,T,terres,,,4347,-3.88162,48.467153
2019-364967,2019-03-12,000001,Vente,45000,,,CLOSTROU,B011,29410,29202,Plounéour-Ménez,29,,,292020000C0277,,,,,,,,,,,,,0,,,,,L,landes,,,1025,-3.881986,48.466468
2019-364967,2019-03-12,000001,Vente,45000,,,CLOSTROU,B011,29410,29202,Plounéour-Ménez,29,,,292020000C0278,,,,,,,,,,,,,0,,,,,T,terres,,,3938,-3.8815,48.466355
2019-364967,2019-03-12,000001,Vente,45000,,,CLOSTROU,B011,29410,29202,Plounéour-Ménez,29,,,292020000C0279,,,,,,,,,,,,,0,,,,,L,landes,,,340,-3.881303,48.466063
2019-364967,2019-03-12,000001,Vente,45000,,,CLOSTROU,B011,29410,29202,Plounéour-Ménez,29,,,292020000C0280,,,,,,,,,,,,,0,,,,,T,terres,,,5103,-3.880916,48.466565
2019-364967,2019-03-12,000001,Vente,45000,,,CLOSTROU,B011,29410,29202,Plounéour-Ménez,29,,,292020000C0281,,,,,,,,,,,,,0,,,,,T,terres,,,12288,-3.88062,48.46582
2019-364967,2019-03-12,000001,Vente,45000,,,CLOSTROU,B011,29410,29202,Plounéour-Ménez,29,,,292020000C0282,,,,,,,,,,,,,0,,,,,L,landes,,,2002,-3.880946,48.465516
2019-364967,2019-03-12,000001,Vente,45000,,,CLOSTROU,B011,29410,29202,Plounéour-Ménez,29,,,292020000D0995,,,,,,,,,,,,,0,,,,,P,prés,,,11267,-3.879016,48.463497
2019-364967,2019-03-12,000001,Vente,45000,,,CLOSTROU,B011,29410,29202,Plounéour-Ménez,29,,,292020000D0996,,,,,,,,,,,,,0,,,,,P,prés,,,3122,-3.880054,48.462888
2019-364967,2019-03-12,000001,Vente,45000,,,CLOSTROU,B011,29410,29202,Plounéour-Ménez,29,,,292020000D1000,,,,,,,,,,,,,0,,,,,T,terres,,,10636,-3.879581,48.46397
2019-364967,2019-03-12,000001,Vente,45000,,,CLOSTROU,B011,29410,29202,Plounéour-Ménez,29,,,292020000D1001,,,,,,,,,,,,,0,,,,,T,terres,,,15610,-3.879079,48.465225
2019-364967,2019-03-12,000001,Vente,45000,,,CLOSTROU,B011,29410,29202,Plounéour-Ménez,29,,,292020000D1002,,,,,,,,,,,,,0,,,,,P,prés,,,300,-3.87847,48.465197
2019-364967,2019-03-12,000001,Vente,45000,,,CLOSTROU,B011,29410,29202,Plounéour-Ménez,29,,,292020000D1092,,,,,,,,,,,,,0,,,,,T,terres,,,8421,-3.877818,48.465326
2019-364983,2019-01-28,000001,Vente,9987.23,,,ROCK STIFEL,B104,29410,29202,Plounéour-Ménez,29,,,292020000H0759,,,,,,,,,,,,,0,,,,,L,landes,,,8785,-3.880046,48.415864
2019-364983,2019-01-28,000001,Vente,9987.23,,,ROC TREDUDON,B106,29410,29202,Plounéour-Ménez,29,,,292020000H0932,,,,,,,,,,,,,0,,,,,L,landes,,,1075,-3.887032,48.413143
2019-364983,2019-01-28,000001,Vente,9987.23,,,ROC TREDUDON,B106,29410,29202,Plounéour-Ménez,29,,,292020000H0963,,,,,,,,,,,,,0,,,,,L,landes,,,8545,-3.893186,48.416387
2019-364983,2019-01-28,000001,Vente,9987.23,,,ROC TREDUDON,B106,29410,29202,Plounéour-Ménez,29,,,292020000H0965,,,,,,,,,,,,,0,,,,,L,landes,,,1947,-3.892961,48.416936
2019-364983,2019-01-28,000001,Vente,9987.23,,,ROC TREDUDON,B106,29410,29202,Plounéour-Ménez,29,,,292020000H0966,,,,,,,,,,,,,0,,,,,L,landes,,,6160,-3.892555,48.417359
2019-364983,2019-01-28,000001,Vente,9987.23,,,ROC TREDUDON,B106,29410,29202,Plounéour-Ménez,29,,,292020000H0973,,,,,,,,,,,,,0,,,,,L,landes,,,1431,-3.890648,48.417444
2019-364983,2019-01-28,000001,Vente,9987.23,,,ROC TREDUDON,B106,29410,29202,Plounéour-Ménez,29,,,292020000H0976,,,,,,,,,,,,,0,,,,,L,landes,,,6830,-3.890724,48.418235
2019-364983,2019-01-28,000001,Vente,9987.23,,,ROC TREDUDON,B106,29410,29202,Plounéour-Ménez,29,,,292020000H1021,,,,,,,,,,,,,0,,,,,L,landes,,,5514,-3.890098,48.41521
2019-364983,2019-01-28,000001,Vente,9987.23,,,ROC TREDUDON,B106,29410,29202,Plounéour-Ménez,29,,,292020000H1025,,,,,,,,,,,,,0,,,,,L,landes,,,4748,-3.890895,48.414958
2019-364983,2019-01-28,000001,Vente,9987.23,,,MENN ZONN,B069,29410,29202,Plounéour-Ménez,29,,,292020000H1139,,,,,,,,,,,,,0,,,,,L,landes,,,1099,-3.886313,48.419991
2019-364983,2019-01-28,000001,Vente,9987.23,,,MENN ZONN,B069,29410,29202,Plounéour-Ménez,29,,,292020000H1139,,,,,,,,,,,,,0,,,,,L,landes,,,3300,-3.886313,48.419991
2019-364983,2019-01-28,000001,Vente,9987.23,,,GUERDOUAL,B030,29410,29202,Plounéour-Ménez,29,,,292020000I0503,,,,,,,,,,,,,0,,,,,L,landes,,,3082,-3.901598,48.41966
2019-364983,2019-01-28,000001,Vente,9987.23,,,GUERDOUAL,B030,29410,29202,Plounéour-Ménez,29,,,292020000I0510,,,,,,,,,,,,,0,,,,,T,terres,,,1761,-3.902512,48.419884
2019-364983,2019-01-28,000001,Vente,9987.23,,,GUERDOUAL,B030,29410,29202,Plounéour-Ménez,29,,,292020000I0511,,,,,,,,,,,,,0,,,,,T,terres,,,1321,-3.9033,48.420788
2019-364983,2019-01-28,000001,Vente,9987.23,,,GUERDOUAL,B030,29410,29202,Plounéour-Ménez,29,,,292020000I0516,,,,,,,,,,,,,0,,,,,P,prés,,,1281,-3.904168,48.42108
2019-364983,2019-01-28,000001,Vente,9987.23,,,GUERDOUAL,B030,29410,29202,Plounéour-Ménez,29,,,292020000I0528,,,,,,,,,,,,,0,,,,,P,prés,,,4406,-3.904353,48.422835
2019-364983,2019-01-28,000001,Vente,9987.23,,,GOZFORN,B014,29410,29202,Plounéour-Ménez,29,,,292020000I0539,,,,,,,,,,,,,0,,,,,P,prés,,,805,-3.904664,48.424713
2019-364983,2019-01-28,000001,Vente,9987.23,,,ROZ BRULER,B113,29410,29202,Plounéour-Ménez,29,,,292020000I1119,,,,,,,,,,,,,0,,,,,L,landes,,,1742,-3.903956,48.420272
2019-364983,2019-01-28,000001,Vente,9987.23,,,ROZ BRULER,B113,29410,29202,Plounéour-Ménez,29,,,292020000I1126,,,,,,,,,,,,,0,,,,,L,landes,,,1120,-3.901766,48.418229
2019-364983,2019-01-28,000001,Vente,9987.23,,,ROZ BRULER,B113,29410,29202,Plounéour-Ménez,29,,,292020000I1132,,,,,,,,,,,,,0,,,,,L,landes,,,7530,-3.903025,48.417098
2019-364983,2019-01-28,000001,Vente,9987.23,,,MENEZ GUERROUDOUAL,B065,29410,29202,Plounéour-Ménez,29,,,292020000I1137,,,,,,,,,,,,,0,,,,,L,landes,,,6230,-3.900926,48.418221
2019-364983,2019-01-28,000001,Vente,9987.23,,,MENEZ GUERROUDOUAL,B065,29410,29202,Plounéour-Ménez,29,,,292020000I1138,,,,,,,,,,,,,0,,,,,L,landes,,,4750,-3.901256,48.41885
2019-364983,2019-01-28,000001,Vente,9987.23,,,MENEZ GUERROUDOUAL,B065,29410,29202,Plounéour-Ménez,29,,,292020000I1141,,,,,,,,,,,,,0,,,,,L,landes,,,2938,-3.899095,48.418641
2019-364983,2019-01-28,000001,Vente,9987.23,,,MENEZ GUERROUDOUAL,B065,29410,29202,Plounéour-Ménez,29,,,292020000I1155,,,,,,,,,,,,,0,,,,,L,landes,,,3040,-3.897608,48.417695
2019-364983,2019-01-28,000001,Vente,9987.23,,,MENEZ GUERROUDOUAL,B065,29410,29202,Plounéour-Ménez,29,,,292020000I1170,,,,,,,,,,,,,0,,,,,L,landes,,,4697,-3.896756,48.419687
2019-364983,2019-01-28,000001,Vente,9987.23,,,MENEZ GUERROUDOUAL,B065,29410,29202,Plounéour-Ménez,29,,,292020000I1172,,,,,,,,,,,,,0,,,,,L,landes,,,3140,-3.897322,48.420253
2019-364983,2019-01-28,000001,Vente,9987.23,,,MENEZ GUERROUDOUAL,B065,29410,29202,Plounéour-Ménez,29,,,292020000I1178,,,,,,,,,,,,,0,,,,,T,terres,,,1377,-3.894434,48.420412
2019-364983,2019-01-28,000001,Vente,9987.23,,,MENEZ GUERROUDOUAL,B065,29410,29202,Plounéour-Ménez,29,,,292020000I1189,,,,,,,,,,,,,0,,,,,T,terres,,,2594,-3.893978,48.420689
2019-364983,2019-01-28,000001,Vente,9987.23,,,MENEZ GUERROUDOUAL,B065,29410,29202,Plounéour-Ménez,29,,,292020000I1190,,,,,,,,,,,,,0,,,,,T,terres,,,3053,-3.893253,48.420149
2019-364983,2019-01-28,000001,Vente,9987.23,,,MENEZ GUERROUDOUAL,B065,29410,29202,Plounéour-Ménez,29,,,292020000I1191,,,,,,,,,,,,,0,,,,,T,terres,,,3632,-3.892323,48.420159
2019-364983,2019-01-28,000001,Vente,9987.23,,,MENEZ GUERROUDOUAL,B065,29410,29202,Plounéour-Ménez,29,,,292020000I1192,,,,,,,,,,,,,0,,,,,L,landes,,,4888,-3.892514,48.419848
2019-364983,2019-01-28,000001,Vente,9987.23,,,MENEZ GUERROUDOUAL,B065,29410,29202,Plounéour-Ménez,29,,,292020000I1195,,,,,,,,,,,,,0,,,,,T,terres,,,8778,-3.893442,48.419314
2019-364983,2019-01-28,000001,Vente,9987.23,,,MENEZ GUERROUDOUAL,B065,29410,29202,Plounéour-Ménez,29,,,292020000I1201,,,,,,,,,,,,,0,,,,,L,landes,,,2835,-3.894399,48.417904
2019-364983,2019-01-28,000001,Vente,9987.23,,,MENEZ GUERROUDOUAL,B065,29410,29202,Plounéour-Ménez,29,,,292020000I1207,,,,,,,,,,,,,0,,,,,L,landes,,,2164,-3.895525,48.415831
2019-364983,2019-01-28,000001,Vente,9987.23,,,MENEZ GUERROUDOUAL,B065,29410,29202,Plounéour-Ménez,29,,,292020000I1210,,,,,,,,,,,,,0,,,,,L,landes,,,894,-3.895114,48.415306
2019-364993,2019-03-07,000001,Vente,70000,458,,LA GRAND ROUTE,B025,29410,29202,Plounéour-Ménez,29,,,292020000F1023,,,,,,,,,,,,,0,2,Appartement,30,2,S,sols,,,392,-3.880537,48.447928
2019-364993,2019-03-07,000001,Vente,70000,458,,LA GRAND ROUTE,B025,29410,29202,Plounéour-Ménez,29,,,292020000F1023,,,,,,,,,,,,,0,1,Maison,60,4,S,sols,,,392,-3.880537,48.447928
2019-364993,2019-03-07,000001,Vente,70000,,,LA GRAND ROUTE,B025,29410,29202,Plounéour-Ménez,29,,,292020000F1172,,,,,,,,,,,,,0,,,,,S,sols,,,800,-3.880195,48.447736
2019-364993,2019-03-07,000001,Vente,70000,,,LA GRAND ROUTE,B025,29410,29202,Plounéour-Ménez,29,,,292020000F1172,,,,,,,,,,,,,0,,,,,T,terres,,,707,-3.880195,48.447736
2019-365017,2019-03-18,000001,Vente,10667,,,ROCK TOUL AR VOUAREM,B105,29410,29202,Plounéour-Ménez,29,,,292020000H0840,,,,,,,,,,,,,0,,,,,L,landes,,,7295,-3.846584,48.425279
2019-365017,2019-03-18,000001,Vente,10667,,,MENN ZONN,B069,29410,29202,Plounéour-Ménez,29,,,292020000H1141,,,,,,,,,,,,,0,,,,,L,landes,,,6193,-3.8868,48.419365