id_mutation,date_mutation,numero_disposition,nature_mutation,valeur_fonciere,adresse_numero,adresse_suffixe,adresse_nom_voie,adresse_code_voie,code_postal,code_commune,nom_commune,code_departement,ancien_code_commune,ancien_nom_commune,id_parcelle,ancien_id_parcelle,numero_volume,lot1_numero,lot1_surface_carrez,lot2_numero,lot2_surface_carrez,lot3_numero,lot3_surface_carrez,lot4_numero,lot4_surface_carrez,lot5_numero,lot5_surface_carrez,nombre_lots,code_type_local,type_local,surface_reelle_bati,nombre_pieces_principales,code_nature_culture,nature_culture,code_nature_culture_speciale,nature_culture_speciale,surface_terrain,longitude,latitude
2019-369021,2019-03-21,000001,Vente,435000,5128,,VILLANOVA,B053,20167,2A351,Villanova,2A,,,2A3510000B0312,,,,,,,,,,,,,0,3,Dépendance,,0,B,bois,MAQUI,Maquis,1800,8.669527,41.958924
2019-369021,2019-03-21,000001,Vente,435000,5128,,VILLANOVA,B053,20167,2A351,Villanova,2A,,,2A3510000B0312,,,,,,,,,,,,,0,1,Maison,120,4,B,bois,MAQUI,Maquis,1800,8.669527,41.958924
2019-369021,2019-03-21,000001,Vente,435000,5128,,VILLANOVA,B053,20167,2A351,Villanova,2A,,,2A3510000B0312,,,,,,,,,,,,,0,3,Dépendance,,0,S,sols,,,1000,8.669527,41.958924
2019-369021,2019-03-21,000001,Vente,435000,5128,,VILLANOVA,B053,20167,2A351,Villanova,2A,,,2A3510000B0312,,,,,,,,,,,,,0,1,Maison,120,4,S,sols,,,1000,8.669527,41.958924
2019-369360,2019-04-01,000001,Vente terrain à bâtir,220000,,,MARINE,B029,20167,2A351,Villanova,2A,,,2A3510000A0947,,,,,,,,,,,,,0,,,,,AB,terrains a bâtir,,,1504,8.663843,41.975747
2019-369631,2019-05-17,000002,Vente,2000,,,MARINE,B029,20167,2A351,Villanova,2A,,,2A3510000A0959,,,,,,,,,,,,,0,,,,,AB,terrains a bâtir,,,53,8.668847,41.978311
2019-370827,2019-08-08,000001,Vente,7700,,,CANONICCI,B010,20167,2A351,Villanova,2A,,,2A3510000B0303,,,,,,,,,,,,,0,,,,,T,terres,,,7700,8.664448,41.960982
2019-370875,2019-08-19,000001,Vente,290000,5120,,SAN FEDELE,B044,20167,2A351,Villanova,2A,,,2A3510000A0586,,,,,,,,,,,,,0,1,Maison,80,4,S,sols,,,300,8.675001,41.962759
2019-370974,2019-08-21,000001,Vente,90000,,,FIGA RANCIGA,B021,20167,2A351,Villanova,2A,,,2A3510000A0847,,,,,,,,,,,,,0,,,,,AB,terrains a bâtir,,,1505,8.683992,41.96101
2019-370976,2019-08-21,000001,Vente,90000,,,FIGA RANCIGA,B021,20167,2A351,Villanova,2A,,,2A3510000A0846,,,,,,,,,,,,,0,,,,,AB,terrains a bâtir,,,1612,8.684457,41.961119
