id_mutation,date_mutation,numero_disposition,nature_mutation,valeur_fonciere,adresse_numero,adresse_suffixe,adresse_nom_voie,adresse_code_voie,code_postal,code_commune,nom_commune,code_departement,ancien_code_commune,ancien_nom_commune,id_parcelle,ancien_id_parcelle,numero_volume,lot1_numero,lot1_surface_carrez,lot2_numero,lot2_surface_carrez,lot3_numero,lot3_surface_carrez,lot4_numero,lot4_surface_carrez,lot5_numero,lot5_surface_carrez,nombre_lots,code_type_local,type_local,surface_reelle_bati,nombre_pieces_principales,code_nature_culture,nature_culture,code_nature_culture_speciale,nature_culture_speciale,surface_terrain,longitude,latitude
2019-425643,2019-01-30,000001,Vente,10000,,,MARTY,B030,31190,31128,Caujac,31,,,311280000B0358,,,,,,,,,,,,,0,,,,,T,terres,,,3350,1.450085,43.275462
2019-425643,2019-01-30,000001,Vente,10000,,,MARTY,B030,31190,31128,Caujac,31,,,311280000B0359,,,,,,,,,,,,,0,,,,,T,terres,,,500,1.450032,43.275011
2019-425643,2019-01-30,000001,Vente,10000,,,MARTY,B030,31190,31128,Caujac,31,,,311280000B0720,,,,,,,,,,,,,0,,,,,P,prés,,,2366,1.450183,43.276251
2019-426385,2019-03-16,000001,Vente,265000,,,LE BOURG,B009,31190,31128,Caujac,31,,,311280000A0044,,,,,,,,,,,,,0,,,,,J,jardins,,,277,1.467757,43.298698
2019-426385,2019-03-16,000001,Vente,265000,11,,RUE DE L'EGLISE,0075,31190,31128,Caujac,31,,,311280000A0045,,,,,,,,,,,,,0,1,Maison,111,4,S,sols,,,247,1.467927,43.298651
2019-427019,2019-05-21,000001,Vente,1,,,FARDEILLAC,B023,31190,31128,Caujac,31,,,311280000B0913,,,,,,,,,,,,,0,,,,,T,terres,,,638,1.449349,43.293138
2019-427019,2019-05-21,000001,Vente,1,,,FARDEILLAC,B023,31190,31128,Caujac,31,,,311280000B0914,,,,,,,,,,,,,0,,,,,T,terres,,,254,1.448546,43.293068
2019-427019,2019-05-21,000001,Vente,1,,,FARDEILLAC,B023,31190,31128,Caujac,31,,,311280000B0916,,,,,,,,,,,,,0,,,,,BT,taillis simples,,,108,1.44877,43.293119
2019-427019,2019-05-21,000001,Vente,1,,,FARDEILLAC,B023,31190,31128,Caujac,31,,,311280000B0918,,,,,,,,,,,,,0,,,,,P,prés,,,372,1.450511,43.293282
2019-427608,2019-07-06,000001,Vente,167000,95,,CHE D'ARGAIN,0025,31190,31128,Caujac,31,,,31128000WB0054,,,,,,,,,,,,,0,1,Maison,94,5,S,sols,,,1000,1.460873,43.298515
2019-427608,2019-07-06,000001,Vente,167000,95,,CHE D'ARGAIN,0025,31190,31128,Caujac,31,,,31128000WB0054,,,,,,,,,,,,,0,1,Maison,94,5,AG,terrains d'agrément,,,634,1.460873,43.298515
2019-427876,2019-06-28,000001,Vente,170000,48,,RUE DU BOURG,0048,31190,31128,Caujac,31,,,311280000A0896,,,,,,,,,,,,,0,1,Maison,83,4,S,sols,,,235,1.469214,43.300771
2019-428015,2019-07-27,000001,Vente,60000,,,ARGAIN,B002,31190,31128,Caujac,31,,,31128000WB0053,,,,,,,,,,,,,0,,,,,T,terres,,,1422,1.460038,43.298045
2019-428122,2019-07-25,000001,Vente,236000,7,,RUE DU BOURG,0048,31190,31128,Caujac,31,,,311280000A0889,,,,,,,,,,,,,0,1,Maison,101,3,S,sols,,,830,1.468462,43.300748
2019-428208,2019-07-31,000001,Vente,75000,4,,RUE DU PRESBYTERE,0145,31190,31128,Caujac,31,,,311280000A0050,,,,,,,,,,,,,0,1,Maison,80,4,S,sols,,,50,1.468515,43.298768
2019-428409,2019-08-21,000001,Vente,43000,,,ARGAIN,B002,31190,31128,Caujac,31,,,31128000WB0055,,,,,,,,,,,,,0,,,,,AG,terrains d'agrément,,,1190,1.46067,43.298342
2019-428450,2019-09-04,000001,Vente,76400,2,,IMP DE LA VILLE,0195,31190,31128,Caujac,31,,,311280000A0028,,,,,,,,,,,,,0,1,Maison,66,3,S,sols,,,57,1.468985,43.299061
2019-428901,2019-10-03,000001,Vente,213600,5012,F,AYRAL,B003,31190,31128,Caujac,31,,,31128000WC0063,,,,,,,,,,,,,0,1,Maison,105,4,S,sols,,,699,1.468655,43.302365
2019-429117,2019-10-08,000002,Vente,15000,,,BOURRIANNE,B010,31190,31128,Caujac,31,,,311280000B0922,,,,,,,,,,,,,0,,,,,T,terres,,,194,1.465311,43.287733
2019-430361,2019-12-30,000001,Vente,225000,265,,RTE D'ESCAYRE,0080,31190,31128,Caujac,31,,,31128000WA0091,,,,,,,,,,,,,0,1,Maison,96,5,S,sols,,,1394,1.467157,43.295706
2019-430361,2019-12-30,000001,Vente,225000,,,MERCIE,B032,31190,31128,Caujac,31,,,31128000WA0094,,,,,,,,,,,,,0,,,,,AG,terrains d'agrément,,,1106,1.466997,43.295618
2019-430361,2019-12-30,000001,Vente,225000,,,MERCIE,B032,31190,31128,Caujac,31,,,31128000WA0095,,,,,,,,,,,,,0,,,,,S,sols,,,96,1.466668,43.29565
