id_mutation,date_mutation,numero_disposition,nature_mutation,valeur_fonciere,adresse_numero,adresse_suffixe,adresse_nom_voie,adresse_code_voie,code_postal,code_commune,nom_commune,code_departement,ancien_code_commune,ancien_nom_commune,id_parcelle,ancien_id_parcelle,numero_volume,lot1_numero,lot1_surface_carrez,lot2_numero,lot2_surface_carrez,lot3_numero,lot3_surface_carrez,lot4_numero,lot4_surface_carrez,lot5_numero,lot5_surface_carrez,nombre_lots,code_type_local,type_local,surface_reelle_bati,nombre_pieces_principales,code_nature_culture,nature_culture,code_nature_culture_speciale,nature_culture_speciale,surface_terrain,longitude,latitude
2019-426493,2019-03-15,000001,Vente,215000,17,,RUE DE LA FONTAINE DE BUC,0112,31390,31525,Salles-sur-Garonne,31,,,315250000B0735,,,,,,,,,,,,,0,1,Maison,110,4,S,sols,,,870,1.18175,43.274078
2019-426592,2019-04-02,000002,Vente,22500,,,VILLAGE,B029,31390,31525,Salles-sur-Garonne,31,,,315250000A0985,,,,,,,,,,,,,0,,,,,J,jardins,,,31,1.179558,43.272513
2019-426592,2019-04-02,000002,Vente,22500,,,VILLAGE,B029,31390,31525,Salles-sur-Garonne,31,,,315250000A0986,,,,,,,,,,,,,0,,,,,J,jardins,,,287,1.1795,43.272533
2019-426597,2019-04-03,000001,Vente,18000,,,PONT D ERCUS,B025,31390,31525,Salles-sur-Garonne,31,,,315250000B0239,,,,,,,,,,,,,0,,,,,T,terres,,,3725,1.18303,43.282586
2019-426597,2019-04-03,000001,Vente,18000,,,PONT D ERCUS,B025,31390,31525,Salles-sur-Garonne,31,,,315250000B0240,,,,,,,,,,,,,0,,,,,T,terres,,,7225,1.181797,43.28226
2019-426597,2019-04-03,000001,Vente,18000,,,PONT D ERCUS,B025,31390,31525,Salles-sur-Garonne,31,,,315250000B0241,,,,,,,,,,,,,0,,,,,T,terres,,,4560,1.180751,43.282015
2019-426597,2019-04-03,000001,Vente,18000,,,PONT D ERCUS,B025,31390,31525,Salles-sur-Garonne,31,,,315250000B0242,,,,,,,,,,,,,0,,,,,T,terres,,,1120,1.179393,43.281724
2019-426597,2019-04-03,000001,Vente,18000,,,PONT D ERCUS,B025,31390,31525,Salles-sur-Garonne,31,,,315250000B0243,,,,,,,,,,,,,0,,,,,T,terres,,,1822,1.179669,43.281734
2019-426597,2019-04-03,000001,Vente,18000,,,PONT D ERCUS,B025,31390,31525,Salles-sur-Garonne,31,,,315250000B0244,,,,,,,,,,,,,0,,,,,VI,vignes,,,1240,1.179725,43.281594
2019-426597,2019-04-03,000001,Vente,18000,,,PONT D ERCUS,B025,31390,31525,Salles-sur-Garonne,31,,,315250000B0245,,,,,,,,,,,,,0,,,,,T,terres,,,3170,1.17989,43.281406
2019-426597,2019-04-03,000001,Vente,18000,,,PONT D ERCUS,B025,31390,31525,Salles-sur-Garonne,31,,,315250000B0724,,,,,,,,,,,,,0,,,,,P,prés,,,13322,1.181631,43.281699
2019-426689,2019-04-09,000001,Vente,19342,,,LOBIT,B020,31390,31525,Salles-sur-Garonne,31,,,315250000A0350,,,,,,,,,,,,,0,,,,,BT,taillis simples,,,1190,1.171963,43.268105
2019-426689,2019-04-09,000001,Vente,19342,,,LOBIT,B020,31390,31525,Salles-sur-Garonne,31,,,315250000A0351,,,,,,,,,,,,,0,,,,,T,terres,,,6260,1.172663,43.268147
2019-426689,2019-04-09,000001,Vente,19342,,,LOBIT,B020,31390,31525,Salles-sur-Garonne,31,,,315250000A0352,,,,,,,,,,,,,0,,,,,T,terres,,,2880,1.173078,43.268766
2019-426689,2019-04-09,000001,Vente,19342,,,LOBIT,B020,31390,31525,Salles-sur-Garonne,31,,,315250000A0555,,,,,,,,,,,,,0,,,,,T,terres,,,748,1.173366,43.267654
2019-426689,2019-04-09,000001,Vente,19342,,,LOBIT,B020,31390,31525,Salles-sur-Garonne,31,,,315250000A0565,,,,,,,,,,,,,0,,,,,T,terres,,,4930,1.173801,43.268301
2019-426689,2019-04-09,000001,Vente,19342,,,LOBIT,B020,31390,31525,Salles-sur-Garonne,31,,,315250000A0579,,,,,,,,,,,,,0,,,,,T,terres,,,4224,1.173672,43.267766
2019-426689,2019-04-09,000001,Vente,19342,,,LOBIT,B020,31390,31525,Salles-sur-Garonne,31,,,315250000A0581,,,,,,,,,,,,,0,,,,,T,terres,,,2641,1.173366,43.26748
2019-426689,2019-04-09,000001,Vente,19342,,,LOBIT,B020,31390,31525,Salles-sur-Garonne,31,,,315250000A0603,,,,,,,,,,,,,0,,,,,T,terres,,,735,1.17384,43.268724
2019-426689,2019-04-09,000001,Vente,19342,,,LOBIT,B020,31390,31525,Salles-sur-Garonne,31,,,315250000A0604,,,,,,,,,,,,,0,,,,,T,terres,,,10525,1.17424,43.269525
2019-426689,2019-04-09,000001,Vente,19342,,,LOBIT,B020,31390,31525,Salles-sur-Garonne,31,,,315250000A0663,,,,,,,,,,,,,0,,,,,T,terres,,,2430,1.17198,43.267786
2019-426689,2019-04-09,000001,Vente,19342,,,LOBIT,B020,31390,31525,Salles-sur-Garonne,31,,,315250000A0665,,,,,,,,,,,,,0,,,,,T,terres,,,673,1.172534,43.267583
2019-426689,2019-04-09,000001,Vente,19342,,,LOBIT,B020,31390,31525,Salles-sur-Garonne,31,,,315250000A0667,,,,,,,,,,,,,0,,,,,T,terres,,,3165,1.173129,43.267237
2019-426689,2019-04-09,000001,Vente,19342,,,LOBIT,B020,31390,31525,Salles-sur-Garonne,31,,,315250000A0959,,,,,,,,,,,,,0,,,,,S,sols,,,364,,
2019-426689,2019-04-09,000001,Vente,19342,,,LOBIT,B020,31390,31525,Salles-sur-Garonne,31,,,315250000A0960,,,,,,,,,,,,,0,,,,,T,terres,,,914,1.173368,43.269458
2019-426689,2019-04-09,000001,Vente,19342,,,LOBIT,B020,31390,31525,Salles-sur-Garonne,31,,,315250000A0970,,,,,,,,,,,,,0,,,,,T,terres,,,7413,1.174134,43.269977
2019-427611,2019-06-17,000001,Vente,213000,,,FONTAINE DE BUC,B008,31390,31525,Salles-sur-Garonne,31,,,315250000B0741,,,,,,,,,,,,,0,,,,,T,terres,,,1201,1.181449,43.275109
2019-427695,2019-07-11,000001,Vente,208000,69,A,BARTERY,B001,31390,31525,Salles-sur-Garonne,31,,,315250000B0649,,,,,,,,,,,,,0,1,Maison,106,4,S,sols,,,1807,1.178654,43.277779
2019-427695,2019-07-11,000001,Vente,208000,,,BARTERY,B001,31390,31525,Salles-sur-Garonne,31,,,315250000B0651,,,,,,,,,,,,,0,,,,,S,sols,,,80,1.178589,43.277886
2019-428414,2019-08-14,000001,Vente,223400,5005,F,GARAGNON,B010,31390,31525,Salles-sur-Garonne,31,,,315250000A0890,,,,,,,,,,,,,0,1,Maison,135,5,S,sols,,,1000,1.157989,43.265903
2019-428414,2019-08-14,000001,Vente,223400,5005,F,GARAGNON,B010,31390,31525,Salles-sur-Garonne,31,,,315250000A0890,,,,,,,,,,,,,0,1,Maison,135,5,AG,terrains d'agrément,PARC,Parc,1493,1.157989,43.265903
2019-428497,2019-08-07,000001,Vente,302000,52,,VILLAGE,B029,31390,31525,Salles-sur-Garonne,31,,,315250000A0385,,,,,,,,,,,,,0,1,Maison,186,6,S,sols,,,400,1.176791,43.271817
2019-428497,2019-08-07,000001,Vente,302000,,,VILLAGE,B029,31390,31525,Salles-sur-Garonne,31,,,315250000A0386,,,,,,,,,,,,,0,,,,,J,jardins,,,470,1.176694,43.271919
2019-428497,2019-08-07,000001,Vente,302000,5011,F,VILLAGE,B029,31390,31525,Salles-sur-Garonne,31,,,315250000A0528,,,,,,,,,,,,,0,3,Dépendance,,0,BT,taillis simples,,,632,1.176515,43.271804
2019-428745,2019-09-13,000001,Vente,190000,,,PLAISANCE,B024,31390,31525,Salles-sur-Garonne,31,,,315250000B0653,,,,,,,,,,,,,0,,,,,T,terres,,,599,1.166455,43.279335
2019-428745,2019-09-13,000001,Vente,190000,5001,F,PLAISANCE,B024,31390,31525,Salles-sur-Garonne,31,,,315250000B0656,,,,,,,,,,,,,0,1,Maison,78,3,S,sols,,,1597,1.166388,43.279099
2019-428891,2019-09-30,000001,Vente,159400,100,,FONTAINE DE BUC,B008,31390,31525,Salles-sur-Garonne,31,,,315250000B0508,,,,,,,,,,,,,0,1,Maison,69,4,S,sols,,,684,1.177928,43.276888
2019-429579,2019-10-29,000002,Vente,1,,,FONTAINE DE BUC,B008,31390,31525,Salles-sur-Garonne,31,,,315250000B0757,,,,,,,,,,,,,0,,,,,S,sols,,,230,1.179194,43.273791
2019-429579,2019-10-29,000002,Vente,1,,,FONTAINE DE BUC,B008,31390,31525,Salles-sur-Garonne,31,,,315250000B0758,,,,,,,,,,,,,0,,,,,S,sols,,,2291,1.179771,43.274224
2019-429579,2019-10-29,000002,Vente,1,2,,IMP DES SAULES,0365,31390,31525,Salles-sur-Garonne,31,,,315250000B0765,,,,,,,,,,,,,0,,,,,S,sols,,,1,1.180107,43.274368
2019-429579,2019-10-29,000002,Vente,1,,,FONTAINE DE BUC,B008,31390,31525,Salles-sur-Garonne,31,,,315250000B0766,,,,,,,,,,,,,0,,,,,S,sols,,,1,1.179933,43.274257
2019-429579,2019-10-29,000002,Vente,1,,,FONTAINE DE BUC,B008,31390,31525,Salles-sur-Garonne,31,,,315250000B0767,,,,,,,,,,,,,0,,,,,S,sols,,,1,1.179779,43.274154
2019-429579,2019-10-29,000002,Vente,1,,,FONTAINE DE BUC,B008,31390,31525,Salles-sur-Garonne,31,,,315250000B0768,,,,,,,,,,,,,0,,,,,S,sols,,,1,1.179693,43.274003
2019-429579,2019-10-29,000002,Vente,1,,,FONTAINE DE BUC,B008,31390,31525,Salles-sur-Garonne,31,,,315250000B0770,,,,,,,,,,,,,0,,,,,S,sols,,,1,1.180054,43.274502
2019-429579,2019-10-29,000002,Vente,1,,,FONTAINE DE BUC,B008,31390,31525,Salles-sur-Garonne,31,,,315250000B0771,,,,,,,,,,,,,0,,,,,S,sols,,,1,1.179901,43.274399
2019-429579,2019-10-29,000002,Vente,1,,,FONTAINE DE BUC,B008,31390,31525,Salles-sur-Garonne,31,,,315250000B0772,,,,,,,,,,,,,0,,,,,S,sols,,,1,1.179708,43.274277
2019-429579,2019-10-29,000002,Vente,1,,,FONTAINE DE BUC,B008,31390,31525,Salles-sur-Garonne,31,,,315250000B0773,,,,,,,,,,,,,0,,,,,S,sols,,,1,1.179486,43.27417
2019-429579,2019-10-29,000002,Vente,1,,,FONTAINE DE BUC,B008,31390,31525,Salles-sur-Garonne,31,,,315250000B0775,,,,,,,,,,,,,0,,,,,S,sols,,,1,1.179466,43.27402
2019-429605,2019-11-09,000001,Vente,202000,69,A,BARTERY,B001,31390,31525,Salles-sur-Garonne,31,,,315250000B0650,,,,,,,,,,,,,0,1,Maison,106,4,S,sols,,,1569,1.179062,43.278049
2019-429605,2019-11-09,000001,Vente,202000,,,BARTERY,B001,31390,31525,Salles-sur-Garonne,31,,,315250000B0652,,,,,,,,,,,,,0,,,,,S,sols,,,58,1.178934,43.278173
2019-429607,2019-11-12,000001,Vente,94000,,,LAMEDAN,B019,31390,31525,Salles-sur-Garonne,31,,,315250000B0761,,,,,,,,,,,,,0,,,,,T,terres,,,2259,1.181992,43.275097
2019-430097,2019-11-29,000001,Vente,467850,,,LAMEDAN,B019,31390,31525,Salles-sur-Garonne,31,,,315250000B0669,,,,,,,,,,,,,0,,,,,S,sols,,,58,1.183775,43.273646
2019-430097,2019-11-29,000001,Vente,467850,,,LAMEDAN,B019,31390,31525,Salles-sur-Garonne,31,,,315250000B0670,,,,,,,,,,,,,0,,,,,S,sols,,,302,1.183512,43.273941
2019-430097,2019-11-29,000001,Vente,467850,5006,F,LAMEDAN,B019,31390,31525,Salles-sur-Garonne,31,,,315250000B0672,,,,,,,,,,,,,0,1,Maison,201,7,AG,terrains d'agrément,PARC,Parc,3000,1.184025,43.273805
2019-430097,2019-11-29,000001,Vente,467850,5006,F,LAMEDAN,B019,31390,31525,Salles-sur-Garonne,31,,,315250000B0672,,,,,,,,,,,,,0,1,Maison,201,7,S,sols,,,1000,1.184025,43.273805
2019-430097,2019-11-29,000001,Vente,467850,,,LAMEDAN,B019,31390,31525,Salles-sur-Garonne,31,,,315250000B0673,,,,,,,,,,,,,0,,,,,S,sols,,,294,1.18394,43.274271
