id_mutation,date_mutation,numero_disposition,nature_mutation,valeur_fonciere,adresse_numero,adresse_suffixe,adresse_nom_voie,adresse_code_voie,code_postal,code_commune,nom_commune,code_departement,ancien_code_commune,ancien_nom_commune,id_parcelle,ancien_id_parcelle,numero_volume,lot1_numero,lot1_surface_carrez,lot2_numero,lot2_surface_carrez,lot3_numero,lot3_surface_carrez,lot4_numero,lot4_surface_carrez,lot5_numero,lot5_surface_carrez,nombre_lots,code_type_local,type_local,surface_reelle_bati,nombre_pieces_principales,code_nature_culture,nature_culture,code_nature_culture_speciale,nature_culture_speciale,surface_terrain,longitude,latitude
2019-431258,2019-05-28,000001,Vente,7500,,,LE VILLAGE,B050,31350,31528,Saman,31,,,31528000ZE0083,,,,,,,,,,,,,0,,,,,T,terres,,,2730,0.717743,43.23612
2019-431765,2019-08-20,000001,Vente,150000,9100,,LAS PERYETTOS,B030,31350,31528,Saman,31,,,31528000ZB0190,,,,,,,,,,,,,0,1,Maison,100,4,T,terres,,,7122,0.729485,43.237864
2019-431973,2019-09-25,000001,Vente,25000,,,LUQUET,B035,31350,31528,Saman,31,,,31528000ZA0005,,,,,,,,,,,,,0,,,,,L,landes,,,24620,0.707658,43.249867
2019-431973,2019-09-25,000001,Vente,25000,,,LUQUET,B035,31350,31528,Saman,31,,,31528000ZA0005,,,,,,,,,,,,,0,,,,,T,terres,,,4548,0.707658,43.249867
2019-431973,2019-09-25,000001,Vente,25000,,,LUQUET,B035,31350,31528,Saman,31,,,31528000ZA0005,,,,,,,,,,,,,0,,,,,BF,futaies feuillues,,,7372,0.707658,43.249867
2019-431973,2019-09-25,000001,Vente,25000,,,SARRAOUERO ET BERNISSA,B047,31350,31528,Saman,31,,,31528000ZA0006,,,,,,,,,,,,,0,,,,,T,terres,,,20900,0.707508,43.251164
2019-432274,2019-11-25,000002,Echange,100,,,AOUBIRANES,B001,31350,31528,Saman,31,,,31528000ZB0210,,,,,,,,,,,,,0,,,,,T,terres,,,74,0.735769,43.238933
2019-432274,2019-11-25,000003,Echange,100,,,AOUBIRANES,B001,31350,31528,Saman,31,,,31528000ZB0208,,,,,,,,,,,,,0,,,,,S,sols,,,39,0.73553,43.23882
2019-432425,2019-11-25,000002,Vente,142000,44,,AOUBIRANES,B001,31350,31528,Saman,31,,,31528000ZB0178,,,,,,,,,,,,,0,,,,,S,sols,,,1554,0.735312,43.238949
2019-432425,2019-11-25,000002,Vente,142000,,,AOUBIRANES,B001,31350,31528,Saman,31,,,31528000ZB0179,,,,,,,,,,,,,0,,,,,S,sols,,,84,0.735134,43.238702
2019-432425,2019-11-25,000002,Vente,142000,,,AOUBIRANES,B001,31350,31528,Saman,31,,,31528000ZB0181,,,,,,,,,,,,,0,,,,,T,terres,,,1321,0.73582,43.239126
2019-432425,2019-11-25,000002,Vente,142000,,,AOUBIRANES,B001,31350,31528,Saman,31,,,31528000ZB0207,,,,,,,,,,,,,0,,,,,S,sols,,,53,0.735524,43.238832
2019-432425,2019-11-25,000002,Vente,142000,,,AOUBIRANES,B001,31350,31528,Saman,31,,,31528000ZB0210,,,,,,,,,,,,,0,,,,,T,terres,,,74,0.735769,43.238933
