id_mutation,date_mutation,numero_disposition,nature_mutation,valeur_fonciere,adresse_numero,adresse_suffixe,adresse_nom_voie,adresse_code_voie,code_postal,code_commune,nom_commune,code_departement,ancien_code_commune,ancien_nom_commune,id_parcelle,ancien_id_parcelle,numero_volume,lot1_numero,lot1_surface_carrez,lot2_numero,lot2_surface_carrez,lot3_numero,lot3_surface_carrez,lot4_numero,lot4_surface_carrez,lot5_numero,lot5_surface_carrez,nombre_lots,code_type_local,type_local,surface_reelle_bati,nombre_pieces_principales,code_nature_culture,nature_culture,code_nature_culture_speciale,nature_culture_speciale,surface_terrain,longitude,latitude
2019-432780,2019-01-03,000001,Vente,75000,5001,,A LA BANNERE,B004,32730,32050,Betplan,32,,,320500000A0541,,,,,,,,,,,,,0,1,Maison,130,4,T,terres,,,956,0.199919,43.41579
2019-432780,2019-01-03,000001,Vente,75000,,,A LA BANNERE,B004,32730,32050,Betplan,32,,,320500000A0542,,,,,,,,,,,,,0,,,,,J,jardins,,,321,0.200141,43.415993
2019-432780,2019-01-03,000001,Vente,75000,,,A LA BANNERE,B004,32730,32050,Betplan,32,,,320500000A0543,,,,,,,,,,,,,0,,,,,T,terres,,,504,0.199834,43.415956
2019-432780,2019-01-03,000001,Vente,75000,,,A LA BANNERE,B004,32730,32050,Betplan,32,,,320500000A0544,,,,,,,,,,,,,0,,,,,T,terres,,,773,0.199512,43.415775
2019-432780,2019-01-03,000001,Vente,75000,,,A LA BANNERE,B004,32730,32050,Betplan,32,,,320500000A0549,,,,,,,,,,,,,0,,,,,T,terres,,,760,0.19974,43.416078
2019-433947,2019-05-27,000001,Vente,156000,,,LE VILLAGE,B034,32730,32050,Betplan,32,,,320500000C0137,,,,,,,,,,,,,0,,,,,P,prés,,,3394,0.20028,43.4127
2019-433947,2019-05-27,000001,Vente,156000,5010,,LE VILLAGE,B034,32730,32050,Betplan,32,,,320500000C0138,,,,,,,,,,,,,0,1,Maison,320,7,S,sols,,,1352,0.20079,43.412632
2019-434122,2019-06-04,000001,Vente,130000,,,LE VILLAGE,B034,32730,32050,Betplan,32,,,320500000C0076,,,,,,,,,,,,,0,,,,,T,terres,,,6721,0.19822,43.413918
2019-434122,2019-06-04,000001,Vente,130000,,,LE VILLAGE,B034,32730,32050,Betplan,32,,,320500000C0077,,,,,,,,,,,,,0,,,,,E,eaux,CANAL,Canal,491,0.198221,43.413364
2019-434122,2019-06-04,000001,Vente,130000,,,LE VILLAGE,B034,32730,32050,Betplan,32,,,320500000C0078,,,,,,,,,,,,,0,,,,,S,sols,,,29,0.197673,43.41387
2019-434122,2019-06-04,000001,Vente,130000,,,LE VILLAGE,B034,32730,32050,Betplan,32,,,320500000C0095,,,,,,,,,,,,,0,,,,,P,prés,,,2144,0.197653,43.413374
2019-434122,2019-06-04,000001,Vente,130000,5016,,LE VILLAGE,B034,32730,32050,Betplan,32,,,320500000C0096,,,,,,,,,,,,,0,1,Maison,179,4,S,sols,,,2086,0.19823,43.412948
2019-434122,2019-06-04,000001,Vente,130000,,,LE VILLAGE,B034,32730,32050,Betplan,32,,,320500000C0097,,,,,,,,,,,,,0,,,,,J,jardins,,,910,0.198858,43.413253
2019-435412,2019-09-18,000001,Vente,1500,,,A LAS PLAGNES,B015,32730,32050,Betplan,32,,,320500000A0108,,,,,,,,,,,,,0,,,,,L,landes,,,735,0.2078,43.424023
2019-436686,2019-12-20,000001,Vente,4500,,,A ESPERRUQUET,B010,32730,32050,Betplan,32,,,320500000B0176,,,,,,,,,,,,,0,,,,,P,prés,,,2931,0.227537,43.419623
2019-436686,2019-12-20,000001,Vente,4500,,,A ESPERRUQUET,B010,32730,32050,Betplan,32,,,320500000B0177,,,,,,,,,,,,,0,,,,,BS,taillis sous futaie,,,1210,0.227972,43.419937
2019-436686,2019-12-20,000001,Vente,4500,,,A ESPERRUQUET,B010,32730,32050,Betplan,32,,,320500000B0178,,,,,,,,,,,,,0,,,,,T,terres,,,2586,0.228188,43.420267
2019-436686,2019-12-20,000001,Vente,4500,,,A ESPERRUQUET,B010,32730,32050,Betplan,32,,,320500000B0179,,,,,,,,,,,,,0,,,,,BS,taillis sous futaie,,,2564,0.228361,43.420731
2019-436686,2019-12-20,000001,Vente,4500,,,A ESPERRUQUET,B010,32730,32050,Betplan,32,,,320500000B0182,,,,,,,,,,,,,0,,,,,BT,taillis simples,,,1070,0.228425,43.419778
2019-436686,2019-12-20,000001,Vente,4500,,,A ESPERRUQUET,B010,32730,32050,Betplan,32,,,320500000B0183,,,,,,,,,,,,,0,,,,,L,landes,,,1311,0.228591,43.41945
2019-436686,2019-12-20,000001,Vente,4500,,,A ESPERRUQUET,B010,32730,32050,Betplan,32,,,320500000B0209,,,,,,,,,,,,,0,,,,,BT,taillis simples,,,1895,0.221324,43.418591
2019-436686,2019-12-20,000001,Vente,4500,,,A ESPERRUQUET,B010,32730,32050,Betplan,32,,,320500000B0210,,,,,,,,,,,,,0,,,,,T,terres,,,2663,0.22117,43.41898
2019-436686,2019-12-20,000001,Vente,4500,,,A ESPERRUQUET,B010,32730,32050,Betplan,32,,,320500000B0218,,,,,,,,,,,,,0,,,,,BS,taillis sous futaie,,,4110,0.220584,43.417023
