id_mutation,date_mutation,numero_disposition,nature_mutation,valeur_fonciere,adresse_numero,adresse_suffixe,adresse_nom_voie,adresse_code_voie,code_postal,code_commune,nom_commune,code_departement,ancien_code_commune,ancien_nom_commune,id_parcelle,ancien_id_parcelle,numero_volume,lot1_numero,lot1_surface_carrez,lot2_numero,lot2_surface_carrez,lot3_numero,lot3_surface_carrez,lot4_numero,lot4_surface_carrez,lot5_numero,lot5_surface_carrez,nombre_lots,code_type_local,type_local,surface_reelle_bati,nombre_pieces_principales,code_nature_culture,nature_culture,code_nature_culture_speciale,nature_culture_speciale,surface_terrain,longitude,latitude
2019-433851,2019-05-22,000001,Vente,300,,,AUX BONDONS,B007,32140,32103,Chélan,32,,,321030000D0800,,,,,,,,,,,,,0,,,,,T,terres,,,336,0.552341,43.364251
2019-434275,2019-06-07,000001,Vente,240050,,,A BIERRAT,B005,32140,32103,Chélan,32,,,321030000B0763,,,,,,,,,,,,,0,,,,,P,prés,,,6780,0.543998,43.332863
2019-434275,2019-06-07,000001,Vente,240050,,,A BIERRAT,B005,32140,32103,Chélan,32,,,321030000B0764,,,,,,,,,,,,,0,,,,,L,landes,,,280,0.544488,43.333225
2019-434275,2019-06-07,000001,Vente,240050,5068,,A CARTIER,B039,32140,32103,Chélan,32,,,321030000B0765,,,,,,,,,,,,,0,1,Maison,180,6,S,sols,,,850,0.544056,43.333126
2019-434275,2019-06-07,000001,Vente,240050,,,A BIERRAT,B005,32140,32103,Chélan,32,,,321030000B0766,,,,,,,,,,,,,0,,,,,P,prés,,,800,0.543694,43.333238
2019-434275,2019-06-07,000001,Vente,240050,,,A LA RIVIERE,B028,32140,32103,Chélan,32,,,321030000B0864,,,,,,,,,,,,,0,,,,,T,terres,,,1980,0.544711,43.332273
2019-434275,2019-06-07,000001,Vente,240050,,,A BIERRAT,B005,32140,32103,Chélan,32,,,321030000B1042,,,,,,,,,,,,,0,,,,,T,terres,,,2728,0.544206,43.333389
2019-435639,2019-10-02,000001,Vente,1500,,,A MONTAHIN,B024,32140,32103,Chélan,32,,,321030000A0280,,,,,,,,,,,,,0,,,,,L,landes,,,2990,0.556877,43.33993
2019-435639,2019-10-02,000001,Vente,1500,,,A MONTAHIN,B024,32140,32103,Chélan,32,,,321030000A0286,,,,,,,,,,,,,0,,,,,L,landes,,,1240,0.559354,43.338752
2019-435639,2019-10-02,000001,Vente,1500,,,A MONTAHIN,B024,32140,32103,Chélan,32,,,321030000A0328,,,,,,,,,,,,,0,,,,,BT,taillis simples,,,1730,0.555672,43.338591
2019-435840,2019-10-29,000001,Vente,87000,5028,,AU VILLAGE,B034,32140,32103,Chélan,32,,,321030000B0973,,,,,,,,,,,,,0,1,Maison,75,2,S,sols,,,381,0.547241,43.346603
2019-435840,2019-10-29,000001,Vente,87000,,,AU VILLAGE,B034,32140,32103,Chélan,32,,,321030000B0974,,,,,,,,,,,,,0,,,,,S,sols,,,459,0.547069,43.346457
2019-436184,2019-11-25,000001,Vente,135000,,,A LANNEMAZERE,B016,32140,32103,Chélan,32,,,321030000B0273,,,,,,,,,,,,,0,,,,,J,jardins,,,180,0.557466,43.370554
2019-436184,2019-11-25,000001,Vente,135000,5001,,A LANNEMAZERE,B016,32140,32103,Chélan,32,,,321030000B0275,,,,,,,,,,,,,0,1,Maison,95,4,S,sols,,,900,0.557505,43.370715
2019-436184,2019-11-25,000001,Vente,135000,,,A LANNEMAZERE,B016,32140,32103,Chélan,32,,,321030000B0887,,,,,,,,,,,,,0,,,,,E,eaux,CANAL,Canal,46,0.557062,43.370857
2019-436184,2019-11-25,000001,Vente,135000,,,A LANNEMAZERE,B016,32140,32103,Chélan,32,,,321030000B0888,,,,,,,,,,,,,0,,,,,L,landes,,,554,0.557328,43.37082
2019-436184,2019-11-25,000001,Vente,135000,,,A LANNEMAZERE,B016,32140,32103,Chélan,32,,,321030000B1213,,,,,,,,,,,,,0,,,,,P,prés,,,1088,0.557777,43.370504
2019-436184,2019-11-25,000001,Vente,135000,,,A LANNEMAZERE,B016,32140,32103,Chélan,32,,,321030000B1215,,,,,,,,,,,,,0,,,,,P,prés,,,372,0.557273,43.370633
2019-436184,2019-11-25,000001,Vente,135000,,,A LANNEMAZERE,B016,32140,32103,Chélan,32,,,321030000B1218,,,,,,,,,,,,,0,,,,,E,eaux,CANAL,Canal,25,0.557004,43.37074
2019-436583,2019-12-09,000001,Vente,97000,,,AUX LANDES BOURRAS,B015,32140,32103,Chélan,32,,,321030000C0191,,,,,,,,,,,,,0,,,,,J,jardins,,,750,0.545085,43.348761
2019-436583,2019-12-09,000001,Vente,97000,5026,,A BARBE,B035,32140,32103,Chélan,32,,,321030000C0192,,,,,,,,,,,,,0,1,Maison,108,3,S,sols,,,1274,0.545503,43.348576
2019-436583,2019-12-09,000001,Vente,97000,,,AUX QUANTAOUS,B027,32140,32103,Chélan,32,,,321030000C0194,,,,,,,,,,,,,0,,,,,P,prés,,,5930,0.544982,43.347599
2019-436583,2019-12-09,000001,Vente,97000,,,AUX QUANTAOUS,B027,32140,32103,Chélan,32,,,321030000C0195,,,,,,,,,,,,,0,,,,,T,terres,,,3470,0.544459,43.347737
2019-436583,2019-12-09,000001,Vente,97000,,,AUX QUANTAOUS,B027,32140,32103,Chélan,32,,,321030000C0196,,,,,,,,,,,,,0,,,,,T,terres,,,8950,0.544575,43.348337
2019-436583,2019-12-09,000001,Vente,97000,,,AUX QUANTAOUS,B027,32140,32103,Chélan,32,,,321030000C1084,,,,,,,,,,,,,0,,,,,T,terres,,,1569,0.5436,43.347944
2019-436583,2019-12-09,000001,Vente,97000,,,A BARBE,B035,32140,32103,Chélan,32,,,321030000C1204,,,,,,,,,,,,,0,,,,,S,sols,,,19,0.545719,43.348611
