id_mutation,date_mutation,numero_disposition,nature_mutation,valeur_fonciere,adresse_numero,adresse_suffixe,adresse_nom_voie,adresse_code_voie,code_postal,code_commune,nom_commune,code_departement,ancien_code_commune,ancien_nom_commune,id_parcelle,ancien_id_parcelle,numero_volume,lot1_numero,lot1_surface_carrez,lot2_numero,lot2_surface_carrez,lot3_numero,lot3_surface_carrez,lot4_numero,lot4_surface_carrez,lot5_numero,lot5_surface_carrez,nombre_lots,code_type_local,type_local,surface_reelle_bati,nombre_pieces_principales,code_nature_culture,nature_culture,code_nature_culture_speciale,nature_culture_speciale,surface_terrain,longitude,latitude
2019-432954,2019-02-18,000001,Vente,540000,,,BOUILLON,B006,32230,32111,Courties,32,,,321110000A0232,,,,,,,,,,,,,0,,,,,L,landes,,,6860,0.154555,43.580483
2019-432954,2019-02-18,000001,Vente,540000,,,BOUILLON,B006,32230,32111,Courties,32,,,321110000A0233,,,,,,,,,,,,,0,,,,,BT,taillis simples,,,4390,0.154322,43.581145
2019-432954,2019-02-18,000001,Vente,540000,5014,,LARROUIL,B023,32230,32111,Courties,32,,,321110000C0078,,,,,,,,,,,,,0,1,Maison,370,8,S,sols,,,3231,0.154604,43.575181
2019-432954,2019-02-18,000001,Vente,540000,,,LARROUIL,B023,32230,32111,Courties,32,,,321110000C0345,,,,,,,,,,,,,0,,,,,J,jardins,,,570,0.153877,43.575304
2019-432954,2019-02-18,000001,Vente,540000,,,LARROUIL,B023,32230,32111,Courties,32,,,321110000C0347,,,,,,,,,,,,,0,,,,,T,terres,,,912,0.154112,43.575074
2019-432954,2019-02-18,000001,Vente,540000,,,LARROUIL,B023,32230,32111,Courties,32,,,321110000C0349,,,,,,,,,,,,,0,,,,,L,landes,,,267,0.154689,43.574995
2019-432954,2019-02-18,000001,Vente,540000,,,LARROUIL,B023,32230,32111,Courties,32,,,321110000C0350,,,,,,,,,,,,,0,,,,,L,landes,,,3,0.15493,43.575339
2019-432954,2019-02-18,000001,Vente,540000,,,LARROUIL,B023,32230,32111,Courties,32,,,321110000C0352,,,,,,,,,,,,,0,,,,,S,sols,,,130,0.15485,43.575192
2019-432954,2019-02-18,000001,Vente,540000,,,DERRIERE L ECOLE,B012,32230,32111,Courties,32,,,321110000C0354,,,,,,,,,,,,,0,,,,,T,terres,,,16,0.15496,43.575414
2019-433679,2019-04-29,000001,Echange,450,,,RAVIN DE LARROUIL,B034,32230,32111,Courties,32,,,321110000C0123,,,,,,,,,,,,,0,,,,,L,landes,,,4360,0.151131,43.575244
2019-433679,2019-04-29,000002,Echange,450,,,RAVIN DE LARROUIL,B034,32230,32111,Courties,32,,,321110000C0118,,,,,,,,,,,,,0,,,,,BT,taillis simples,,,1721,0.146517,43.5739
2019-433679,2019-04-29,000002,Echange,450,,,RAVIN DE LARROUIL,B034,32230,32111,Courties,32,,,321110000C0120,,,,,,,,,,,,,0,,,,,BT,taillis simples,,,2780,0.147822,43.574679
2019-435656,2019-10-23,000002,Vente,189.6,,,LE BARON,B001,32230,32111,Courties,32,,,321110000B0441,,,,,,,,,,,,,0,,,,,T,terres,,,79,,
2019-435671,2019-10-23,000002,Vente,2333.87,,,LE BARON,B001,32230,32111,Courties,32,,,321110000B0437,,,,,,,,,,,,,0,,,,,L,landes,,,399,,
2019-435671,2019-10-23,000002,Vente,2333.87,,,LE BARON,B001,32230,32111,Courties,32,,,321110000B0439,,,,,,,,,,,,,0,,,,,L,landes,,,513,,
2019-435672,2019-10-23,000002,Vente,393.6,,,LE BARON,B001,32230,32111,Courties,32,,,321110000B0435,,,,,,,,,,,,,0,,,,,L,landes,,,39,,
