id_mutation,date_mutation,numero_disposition,nature_mutation,valeur_fonciere,adresse_numero,adresse_suffixe,adresse_nom_voie,adresse_code_voie,code_postal,code_commune,nom_commune,code_departement,ancien_code_commune,ancien_nom_commune,id_parcelle,ancien_id_parcelle,numero_volume,lot1_numero,lot1_surface_carrez,lot2_numero,lot2_surface_carrez,lot3_numero,lot3_surface_carrez,lot4_numero,lot4_surface_carrez,lot5_numero,lot5_surface_carrez,nombre_lots,code_type_local,type_local,surface_reelle_bati,nombre_pieces_principales,code_nature_culture,nature_culture,code_nature_culture_speciale,nature_culture_speciale,surface_terrain,longitude,latitude
2019-435570,2019-09-24,000001,Vente,54000,,,A COUCHET,B011,32100,32194,Larressingle,32,,,321940000B0452,,,,,,,,,,,,,0,,,,,S,sols,,,1213,0.327967,43.937581
2019-435570,2019-09-24,000001,Vente,54000,,,A COUCHET,B011,32100,32194,Larressingle,32,,,321940000B0452,,,,,,,,,,,,,0,,,,,J,jardins,,,1675,0.327967,43.937581
2019-435911,2019-11-05,000001,Vente,683250,,,A LA CASSAGNE,B008,32100,32194,Larressingle,32,,,321940000A0199,,,,,,,,,,,,,0,,,,,T,terres,,,8815,0.313442,43.947805
2019-435911,2019-11-05,000001,Vente,683250,,,A LA CASSAGNE,B008,32100,32194,Larressingle,32,,,321940000A0200,,,,,,,,,,,,,0,,,,,T,terres,,,1484,0.313519,43.94803
2019-435911,2019-11-05,000001,Vente,683250,5009,,A LA CASSAGNE,B008,32100,32194,Larressingle,32,,,321940000A0201,,,,,,,,,,,,,0,1,Maison,256,6,S,sols,,,6835,0.312496,43.948274
2019-435911,2019-11-05,000001,Vente,683250,,,A LA CASSAGNE,B008,32100,32194,Larressingle,32,,,321940000A0202,,,,,,,,,,,,,0,,,,,P,prés,,,3707,0.312554,43.94854
2019-435911,2019-11-05,000001,Vente,683250,,,A LA CASSAGNE,B008,32100,32194,Larressingle,32,,,321940000A0203,,,,,,,,,,,,,0,,,,,T,terres,,,34795,0.312327,43.949567
2019-435911,2019-11-05,000001,Vente,683250,,,A LA CASSAGNE,B008,32100,32194,Larressingle,32,,,321940000A0240,,,,,,,,,,,,,0,,,,,P,prés,,,4905,0.312015,43.947712
2019-437669,2019-08-31,000001,Vente,159420,,,AUX LIOUX,B021,32100,32194,Larressingle,32,,,321940000B0201,,,,,,,,,,,,,0,,,,,P,prés,,,3150,0.329702,43.919776
2019-437669,2019-08-31,000001,Vente,159420,,,AUX LIOUX,B021,32100,32194,Larressingle,32,,,321940000B0203,,,,,,,,,,,,,0,,,,,J,jardins,,,582,0.330128,43.919288
2019-437669,2019-08-31,000001,Vente,159420,5068,,AUX LIOUX,B021,32100,32194,Larressingle,32,,,321940000B0204,,,,,,,,,,,,,0,1,Maison,75,4,S,sols,,,4215,0.33021,43.919694
2019-437669,2019-08-31,000001,Vente,159420,,,AUX LIOUX,B021,32100,32194,Larressingle,32,,,321940000B0205,,,,,,,,,,,,,0,,,,,P,prés,,,2515,0.330856,43.919626
2019-437672,2019-09-09,000001,Vente,260000,,,A BOUHEBENT,B004,32100,32194,Larressingle,32,,,321940000A0568,,,,,,,,,,,,,0,,,,,BT,taillis simples,,,2420,0.315641,43.938556
2019-437672,2019-09-09,000001,Vente,260000,,,A BOUHEBENT,B004,32100,32194,Larressingle,32,,,321940000A0569,,,,,,,,,,,,,0,,,,,T,terres,,,4190,0.315635,43.939139
2019-437672,2019-09-09,000001,Vente,260000,,,A BOUHEBENT,B004,32100,32194,Larressingle,32,,,321940000A0570,,,,,,,,,,,,,0,,,,,T,terres,,,1711,0.316036,43.939751
2019-437672,2019-09-09,000001,Vente,260000,,,A BOUHEBENT,B004,32100,32194,Larressingle,32,,,321940000A0571,,,,,,,,,,,,,0,,,,,T,terres,,,2516,0.316492,43.940153
2019-437672,2019-09-09,000001,Vente,260000,5049,,A LA PLAGNE,B039,32100,32194,Larressingle,32,,,321940000A0572,,,,,,,,,,,,,0,1,Maison,175,5,S,sols,,,1241,0.316982,43.940213
2019-437672,2019-09-09,000001,Vente,260000,,,A BOUHEBENT,B004,32100,32194,Larressingle,32,,,321940000A0573,,,,,,,,,,,,,0,,,,,T,terres,,,7955,0.31644,43.939408
