id_mutation,date_mutation,numero_disposition,nature_mutation,valeur_fonciere,adresse_numero,adresse_suffixe,adresse_nom_voie,adresse_code_voie,code_postal,code_commune,nom_commune,code_departement,ancien_code_commune,ancien_nom_commune,id_parcelle,ancien_id_parcelle,numero_volume,lot1_numero,lot1_surface_carrez,lot2_numero,lot2_surface_carrez,lot3_numero,lot3_surface_carrez,lot4_numero,lot4_surface_carrez,lot5_numero,lot5_surface_carrez,nombre_lots,code_type_local,type_local,surface_reelle_bati,nombre_pieces_principales,code_nature_culture,nature_culture,code_nature_culture_speciale,nature_culture_speciale,surface_terrain,longitude,latitude
2019-435574,2019-09-27,000002,Vente,278.4,,,A GUILLAMETON,B030,32100,32197,Larroque-sur-l'Osse,32,,,321970000B1246,,,,,,,,,,,,,0,,,,,T,terres,,,928,0.276029,43.975325
2019-436509,2019-11-22,000001,Vente,280000,,,A LA BOUBEE,B011,32100,32197,Larroque-sur-l'Osse,32,,,321970000B0001,,,,,,,,,,,,,0,,,,,BR,futaies résineuses,,,3326,0.26195,43.968321
2019-436509,2019-11-22,000001,Vente,280000,5126,,A LA BOUBEE,B011,32100,32197,Larroque-sur-l'Osse,32,,,321970000B0954,,,,,,,,,,,,,0,1,Maison,154,5,S,sols,,,1000,0.262003,43.968796
2019-436509,2019-11-22,000001,Vente,280000,5126,,A LA BOUBEE,B011,32100,32197,Larroque-sur-l'Osse,32,,,321970000B0954,,,,,,,,,,,,,0,1,Maison,154,5,T,terres,,,5077,0.262003,43.968796
2019-437018,2019-02-12,000001,Vente,26,,,AU VILLAGE,B063,32100,32197,Larroque-sur-l'Osse,32,,,321970000B1227,,,,,,,,,,,,,0,,,,,S,sols,,,25,0.275041,43.971452
2019-437027,2019-02-12,000001,Vente,7500,5074,,AU VILLAGE,B063,32100,32197,Larroque-sur-l'Osse,32,,,321970000B0300,,,,,,,,,,,,,0,4,Local industriel. commercial ou assimilé,42,0,S,sols,,,58,0.276183,43.971204
2019-437186,2019-03-26,000001,Vente,41763,,,AU ROUCHINO,B050,32100,32197,Larroque-sur-l'Osse,32,,,321970000B0016,,,,,,,,,,,,,0,,,,,VI,vignes,,,7000,0.261951,43.973223
2019-437186,2019-03-26,000001,Vente,41763,,,AU ROUCHINO,B050,32100,32197,Larroque-sur-l'Osse,32,,,321970000B0016,,,,,,,,,,,,,0,,,,,T,terres,,,1970,0.261951,43.973223
2019-437186,2019-03-26,000001,Vente,41763,,,AU ROUCHINO,B050,32100,32197,Larroque-sur-l'Osse,32,,,321970000B0022,,,,,,,,,,,,,0,,,,,T,terres,,,2094,0.262808,43.974417
2019-437186,2019-03-26,000001,Vente,41763,,,AU ROUCHINO,B050,32100,32197,Larroque-sur-l'Osse,32,,,321970000B0022,,,,,,,,,,,,,0,,,,,VI,vignes,,,12000,0.262808,43.974417
2019-437186,2019-03-26,000001,Vente,41763,,,AU ROUCHINO,B050,32100,32197,Larroque-sur-l'Osse,32,,,321970000B1229,,,,,,,,,,,,,0,,,,,VI,vignes,,,3765,0.260911,43.973448
2019-437186,2019-03-26,000001,Vente,41763,,,AU ROUCHINO,B050,32100,32197,Larroque-sur-l'Osse,32,,,321970000B1235,,,,,,,,,,,,,0,,,,,VI,vignes,,,8855,0.261676,43.974386
2019-437186,2019-03-26,000001,Vente,41763,,,AU ROUCHINO,B050,32100,32197,Larroque-sur-l'Osse,32,,,321970000B1235,,,,,,,,,,,,,0,,,,,T,terres,,,6711,0.261676,43.974386
2019-437411,2019-06-18,000001,Vente,23000,,,A LA QUINTANE,B048,32100,32197,Larroque-sur-l'Osse,32,,,321970000A0182,,,,,,,,,,,,,0,,,,,S,sols,,,136,0.281009,43.981732
2019-437411,2019-06-18,000001,Vente,23000,,,A LA QUINTANE,B048,32100,32197,Larroque-sur-l'Osse,32,,,321970000A0183,,,,,,,,,,,,,0,,,,,S,sols,,,1401,0.281005,43.981776
2019-437411,2019-06-18,000001,Vente,23000,,,A LA QUINTANE,B048,32100,32197,Larroque-sur-l'Osse,32,,,321970000A1036,,,,,,,,,,,,,0,,,,,S,sols,,,952,0.281574,43.981579
2019-437624,2019-08-27,000001,Vente,1071.35,,,A CHIROULET,B022,32100,32197,Larroque-sur-l'Osse,32,,,321970000A1390,,,,,,,,,,,,,0,,,,,VI,vignes,,,3061,0.285904,43.991857
