id_mutation,date_mutation,numero_disposition,nature_mutation,valeur_fonciere,adresse_numero,adresse_suffixe,adresse_nom_voie,adresse_code_voie,code_postal,code_commune,nom_commune,code_departement,ancien_code_commune,ancien_nom_commune,id_parcelle,ancien_id_parcelle,numero_volume,lot1_numero,lot1_surface_carrez,lot2_numero,lot2_surface_carrez,lot3_numero,lot3_surface_carrez,lot4_numero,lot4_surface_carrez,lot5_numero,lot5_surface_carrez,nombre_lots,code_type_local,type_local,surface_reelle_bati,nombre_pieces_principales,code_nature_culture,nature_culture,code_nature_culture_speciale,nature_culture_speciale,surface_terrain,longitude,latitude
2019-433653,2019-04-18,000001,Vente,790000,,,A LAUZIN,B063,32490,32268,Monferran-Savès,32,,,322680000G0143,,,,,,,,,,,,,0,,,,,BT,taillis simples,,,6140,,
2019-433653,2019-04-18,000001,Vente,790000,,,A LAUZIN,B063,32490,32268,Monferran-Savès,32,,,322680000G0208,,,,,,,,,,,,,0,,,,,T,terres,,,849,,
2019-433653,2019-04-18,000001,Vente,790000,,,A LAUZIN,B063,32490,32268,Monferran-Savès,32,,,322680000G0210,,,,,,,,,,,,,0,,,,,T,terres,,,444,,
2019-433653,2019-04-18,000001,Vente,790000,,,A LAUZIN,B063,32490,32268,Monferran-Savès,32,,,322680000G0211,,,,,,,,,,,,,0,,,,,T,terres,,,2513,,
2019-433653,2019-04-18,000001,Vente,790000,1056,,RTE DU CASTRUM,0075,32490,32268,Monferran-Savès,32,,,322680000G0213,,,,,,,,,,,,,0,1,Maison,450,10,S,sols,,,3335,,
2019-433653,2019-04-18,000001,Vente,790000,,,A LAUZIN,B063,32490,32268,Monferran-Savès,32,,,322680000G0215,,,,,,,,,,,,,0,,,,,P,prés,,,182,,
2019-433676,2019-04-12,000001,Vente,160000,249,,RTE DE MARESTAING,0155,32490,32268,Monferran-Savès,32,,,32268000AB0055,,,,,,,,,,,,,0,1,Maison,60,3,S,sols,,,606,0.984174,43.597276
2019-433710,2019-04-27,000001,Vente,313900,517,,CHEM D'EN DESPAX,0110,32490,32268,Monferran-Savès,32,,,322680000E0881,,,,,,,,,,,,,0,1,Maison,129,5,S,sols,,,1500,,
2019-433710,2019-04-27,000001,Vente,313900,517,,CHEM D'EN DESPAX,0110,32490,32268,Monferran-Savès,32,,,322680000E0881,,,,,,,,,,,,,0,1,Maison,129,5,T,terres,,,1699,,
2019-433710,2019-04-27,000001,Vente,313900,,,A LARGENTE,B058,32490,32268,Monferran-Savès,32,,,322680000E0882,,,,,,,,,,,,,0,,,,,T,terres,,,1086,,
2019-433710,2019-04-27,000001,Vente,313900,,,A LARGENTE,B058,32490,32268,Monferran-Savès,32,,,322680000E0883,,,,,,,,,,,,,0,,,,,T,terres,,,130,,
2019-433710,2019-04-27,000001,Vente,313900,,,A LARGENTE,B058,32490,32268,Monferran-Savès,32,,,322680000E0904,,,,,,,,,,,,,0,,,,,T,terres,,,290,,
2019-433710,2019-04-27,000001,Vente,313900,,,A LARGENTE,B058,32490,32268,Monferran-Savès,32,,,322680000E0905,,,,,,,,,,,,,0,,,,,T,terres,,,184,,
2019-433813,2019-05-06,000001,Vente,253000,,,AUX CLAOUSES,B031,32490,32268,Monferran-Savès,32,,,322680000F0108,,,,,,,,,,,,,0,,,,,S,sols,,,157,,
2019-433813,2019-05-06,000001,Vente,253000,,,AUX CLAOUSES,B031,32490,32268,Monferran-Savès,32,,,322680000F0420,,,,,,,,,,,,,0,,,,,S,sols,,,65,,
2019-433813,2019-05-06,000001,Vente,253000,211,,RTE ROMAINE,0240,32490,32268,Monferran-Savès,32,,,322680000F0422,,,,,,,,,,,,,0,1,Maison,106,2,S,sols,,,1105,,
2019-433945,2019-05-15,000002,Echange,11214,,,A SAINT CLAMENS,B084,32490,32268,Monferran-Savès,32,,,32268000AC0037,,,,,,,,,,,,,0,,,,,T,terres,,,3738,,
2019-433945,2019-05-15,000003,Echange,11214,,,A LA BOURDETTE,B022,32490,32268,Monferran-Savès,32,,,322680000A0792,,,,,,,,,,,,,0,,,,,T,terres,,,1161,,
2019-433945,2019-05-15,000003,Echange,11214,,,A LA BOURDETTE,B022,32490,32268,Monferran-Savès,32,,,322680000A0794,,,,,,,,,,,,,0,,,,,T,terres,,,10053,,
2019-434000,2019-05-20,000001,Vente,235000,,,A LA NOUGUERE,B074,32490,32268,Monferran-Savès,32,,,322680000D0356,,,,,,,,,,,,,0,,,,,T,terres,,,62,,
2019-434000,2019-05-20,000001,Vente,235000,,,A LA NOUGUERE,B074,32490,32268,Monferran-Savès,32,,,322680000D0358,,,,,,,,,,,,,0,,,,,T,terres,,,2005,,
2019-434000,2019-05-20,000001,Vente,235000,695,,RTE DES ARNES,0010,32490,32268,Monferran-Savès,32,,,322680000D0361,,,,,,,,,,,,,0,1,Maison,108,3,T,terres,,,3689,,
2019-434000,2019-05-20,000001,Vente,235000,695,,RTE DES ARNES,0010,32490,32268,Monferran-Savès,32,,,322680000D0361,,,,,,,,,,,,,0,1,Maison,108,3,S,sols,,,1994,,
2019-434189,2019-06-18,000001,Vente,25000,,,A LOUSTAOU,B065,32490,32268,Monferran-Savès,32,,,322680000F0387,,,,,,,,,,,,,0,,,,,S,sols,,,1990,0.965709,43.632162
2019-434189,2019-06-18,000001,Vente,25000,,,A LOUSTAOU,B065,32490,32268,Monferran-Savès,32,,,322680000F0469,,,,,,,,,,,,,0,,,,,T,terres,,,9941,0.965894,43.633382
2019-434189,2019-06-18,000001,Vente,25000,,,A LOUSTAOU,B065,32490,32268,Monferran-Savès,32,,,322680000F0469,,,,,,,,,,,,,0,,,,,T,terres,,,19491,0.965894,43.633382
2019-435080,2019-08-07,000001,Vente,225000,232,,IMP DU CHEMIN DE FER,0080,32490,32268,Monferran-Savès,32,,,322680000F0087,,,,,,,,,,,,,0,1,Maison,100,4,S,sols,,,147,,
2019-435080,2019-08-07,000001,Vente,225000,,,AUX CLAOUSES,B031,32490,32268,Monferran-Savès,32,,,322680000F0088,,,,,,,,,,,,,0,,,,,J,jardins,,,505,,
2019-435326,2019-06-24,000001,Vente,68440,,,AUX SANSOUMETS,B086,32490,32268,Monferran-Savès,32,,,322680000B0421,,,,,,,,,,,,,0,,,,,J,jardins,,,210,,
2019-435326,2019-06-24,000001,Vente,68440,4450,,RTE NATIONALE,0200,32490,32268,Monferran-Savès,32,,,322680000B0863,,,,,,,,,,,,,0,,,,,S,sols,,,40,,
2019-435326,2019-06-24,000001,Vente,68440,,,AUX SANSOUMETS,B086,32490,32268,Monferran-Savès,32,,,322680000B0864,,,,,,,,,,,,,0,,,,,T,terres,,,1144,,
2019-435328,2019-06-24,000001,Vente,1035,,,A ENBINAGRET,B037,32490,32268,Monferran-Savès,32,,,322680000A0800,,,,,,,,,,,,,0,,,,,T,terres,,,157,,
2019-435329,2019-06-24,000001,Vente,308190,5111,,AUX PAGUERES DE BEAUCOURT,B076,32490,32268,Monferran-Savès,32,,,322680000C0596,,,,,,,,,,,,,0,4,Local industriel. commercial ou assimilé,450,0,S,sols,,,1752,,
2019-435329,2019-06-24,000001,Vente,308190,5111,,AUX PAGUERES DE BEAUCOURT,B076,32490,32268,Monferran-Savès,32,,,322680000C0596,,,,,,,,,,,,,0,4,Local industriel. commercial ou assimilé,450,0,BT,taillis simples,,,10658,,
2019-435329,2019-06-24,000001,Vente,308190,5806,,RTE NATIONALE,0200,32490,32268,Monferran-Savès,32,,,322680000C0647,,,,,,,,,,,,,0,,,,,S,sols,,,785,,
2019-435329,2019-06-24,000001,Vente,308190,5806,,RTE NATIONALE,0200,32490,32268,Monferran-Savès,32,,,322680000C0647,,,,,,,,,,,,,0,,,,,L,landes,,,5470,,
2019-435329,2019-06-24,000001,Vente,308190,,,AUX PAGUERES DE BEAUCOURT,B076,32490,32268,Monferran-Savès,32,,,322680000C0648,,,,,,,,,,,,,0,,,,,S,sols,,,3265,,
2019-435330,2019-06-24,000001,Vente,575,,,A MOUNSENPE,B071,32490,32268,Monferran-Savès,32,,,322680000B0857,,,,,,,,,,,,,0,,,,,S,sols,,,239,,
2019-435332,2019-06-24,000001,Vente,290,,,A ENBINAGRET,B037,32490,32268,Monferran-Savès,32,,,322680000A0799,,,,,,,,,,,,,0,,,,,T,terres,,,44,,
2019-435338,2019-06-24,000001,Vente,910,,,A SAURAIGNAN,B087,32490,32268,Monferran-Savès,32,,,322680000B0201,,,,,,,,,,,,,0,,,,,S,sols,,,10,,
2019-435339,2019-06-24,000001,Vente,49520,,,A ENPONSIN,B044,32490,32268,Monferran-Savès,32,,,322680000A0774,,,,,,,,,,,,,0,,,,,T,terres,,,588,,
2019-435339,2019-06-24,000001,Vente,49520,,,A ENPONSIN,B044,32490,32268,Monferran-Savès,32,,,322680000A0808,,,,,,,,,,,,,0,,,,,T,terres,,,1073,,
2019-435339,2019-06-24,000001,Vente,49520,,,A ENPONSIN,B044,32490,32268,Monferran-Savès,32,,,322680000A0811,,,,,,,,,,,,,0,,,,,T,terres,,,1830,,
2019-435339,2019-06-24,000001,Vente,49520,,,A ENPONSIN,B044,32490,32268,Monferran-Savès,32,,,322680000A0812,,,,,,,,,,,,,0,,,,,S,sols,,,313,,
2019-435599,2019-10-15,000001,Vente,410650,140,,RTE DE CASTILLON,0070,32490,32268,Monferran-Savès,32,,,32268000AC0052,,,,,,,,,,,,,0,1,Maison,147,6,S,sols,,,847,0.981793,43.596797
2019-435599,2019-10-15,000001,Vente,410650,140,,RTE DE CASTILLON,0070,32490,32268,Monferran-Savès,32,,,32268000AC0052,,,,,,,,,,,,,0,1,Maison,147,6,J,jardins,,,772,0.981793,43.596797
2019-436467,2019-12-12,000001,Vente,159000,5147,,AU VILLAGE,B096,32490,32268,Monferran-Savès,32,,,32268000AA0061,,,,,,,,,,,,,0,2,Appartement,60,3,S,sols,,,74,0.979879,43.598212
2019-436467,2019-12-12,000001,Vente,159000,5147,,AU VILLAGE,B096,32490,32268,Monferran-Savès,32,,,32268000AA0061,,,,,,,,,,,,,0,2,Appartement,60,3,S,sols,,,74,0.979879,43.598212
2019-436633,2019-12-17,000001,Vente,1221101,,,A ENBINAGRET,B037,32490,32268,Monferran-Savès,32,,,322680000A0173,,,,,,,,,,,,,0,,,,,S,sols,,,1921,,
2019-436633,2019-12-17,000001,Vente,1221101,,,A ENBINAGRET,B037,32490,32268,Monferran-Savès,32,,,322680000A0173,,,,,,,,,,,,,0,,,,,T,terres,,,499,,
2019-436633,2019-12-17,000001,Vente,1221101,,,A ENBINAGRET,B037,32490,32268,Monferran-Savès,32,,,322680000A0180,,,,,,,,,,,,,0,,,,,T,terres,,,2500,,
2019-436633,2019-12-17,000001,Vente,1221101,316,,CHEM DES CARDAYRES,0065,32490,32268,Monferran-Savès,32,,,322680000A0693,,,,,,,,,,,,,0,4,Local industriel. commercial ou assimilé,1730,0,T,terres,,,718,,
2019-436633,2019-12-17,000001,Vente,1221101,316,,CHEM DES CARDAYRES,0065,32490,32268,Monferran-Savès,32,,,322680000A0693,,,,,,,,,,,,,0,4,Local industriel. commercial ou assimilé,1730,0,S,sols,,,6467,,
2019-436633,2019-12-17,000001,Vente,1221101,,,A ENBINAGRET,B037,32490,32268,Monferran-Savès,32,,,322680000A0694,,,,,,,,,,,,,0,,,,,S,sols,,,1063,,
2019-436633,2019-12-17,000001,Vente,1221101,,,A ENBINAGRET,B037,32490,32268,Monferran-Savès,32,,,322680000A0696,,,,,,,,,,,,,0,,,,,T,terres,,,1836,,
2019-436633,2019-12-17,000001,Vente,1221101,,,A ENBINAGRET,B037,32490,32268,Monferran-Savès,32,,,322680000A0696,,,,,,,,,,,,,0,,,,,S,sols,,,2001,,
2019-436916,2019-06-24,000001,Vente,3665,,,A MOUNSENPE,B071,32490,32268,Monferran-Savès,32,,,322680000B0873,,,,,,,,,,,,,0,,,,,T,terres,,,374,,
2019-436916,2019-06-24,000001,Vente,3665,110,,CHEM DE MOUNSEMPE,0190,32490,32268,Monferran-Savès,32,,,322680000B0875,,,,,,,,,,,,,0,,,,,S,sols,,,181,,
2019-436917,2019-06-24,000001,Vente,80,,,A MOUNSENPE,B071,32490,32268,Monferran-Savès,32,,,322680000B0859,,,,,,,,,,,,,0,,,,,S,sols,,,4,,
2019-436917,2019-06-24,000001,Vente,80,,,A MOUNSENPE,B071,32490,32268,Monferran-Savès,32,,,322680000B0860,,,,,,,,,,,,,0,,,,,S,sols,,,8,,
