id_mutation,date_mutation,numero_disposition,nature_mutation,valeur_fonciere,adresse_numero,adresse_suffixe,adresse_nom_voie,adresse_code_voie,code_postal,code_commune,nom_commune,code_departement,ancien_code_commune,ancien_nom_commune,id_parcelle,ancien_id_parcelle,numero_volume,lot1_numero,lot1_surface_carrez,lot2_numero,lot2_surface_carrez,lot3_numero,lot3_surface_carrez,lot4_numero,lot4_surface_carrez,lot5_numero,lot5_surface_carrez,nombre_lots,code_type_local,type_local,surface_reelle_bati,nombre_pieces_principales,code_nature_culture,nature_culture,code_nature_culture_speciale,nature_culture_speciale,surface_terrain,longitude,latitude
2019-432923,2019-01-29,000001,Vente,190000,5055,,COURTIES,B017,32320,32326,Pouylebon,32,,,323260000B0328,,,,,,,,,,,,,0,1,Maison,130,5,S,sols,,,1224,0.317475,43.532866
2019-432923,2019-01-29,000001,Vente,190000,,,COURTIES,B017,32320,32326,Pouylebon,32,,,323260000B0423,,,,,,,,,,,,,0,,,,,T,terres,,,525,0.317589,43.532765
2019-433134,2019-02-22,000001,Vente,8000,,,PAGUERES,B052,32320,32326,Pouylebon,32,,,323260000C0084,,,,,,,,,,,,,0,,,,,S,sols,,,1985,0.292162,43.528676
2019-433134,2019-02-22,000001,Vente,8000,,,PAGUERES,B052,32320,32326,Pouylebon,32,,,323260000C0502,,,,,,,,,,,,,0,,,,,T,terres,,,6501,0.292064,43.528882
2019-433134,2019-02-22,000001,Vente,8000,,,PAGUERES,B052,32320,32326,Pouylebon,32,,,323260000C0503,,,,,,,,,,,,,0,,,,,T,terres,,,2638,0.292785,43.528653
2019-433134,2019-02-22,000001,Vente,8000,,,PAGUERES,B052,32320,32326,Pouylebon,32,,,323260000C0505,,,,,,,,,,,,,0,,,,,T,terres,,,721,0.292842,43.528308
2019-433134,2019-02-22,000001,Vente,8000,,,SOULAN DE CAUBOUE,B068,32320,32326,Pouylebon,32,,,323260000C0507,,,,,,,,,,,,,0,,,,,T,terres,,,8890,0.290876,43.528529
2019-433134,2019-02-22,000001,Vente,8000,,,SOULAN DE CAUBOUE,B068,32320,32326,Pouylebon,32,,,323260000C0507,,,,,,,,,,,,,0,,,,,S,sols,,,1500,0.290876,43.528529
2019-433134,2019-02-22,000001,Vente,8000,,,SOULAN DE CAUBOUE,B068,32320,32326,Pouylebon,32,,,323260000C0507,,,,,,,,,,,,,0,,,,,T,terres,,,4444,0.290876,43.528529
2019-433446,2019-03-22,000001,Vente,405000,,,PAGUERE DE CALABEL,B050,32320,32326,Pouylebon,32,,,323260000A0096,,,,,,,,,,,,,0,,,,,P,prés,,,1923,0.313654,43.552593
2019-433446,2019-03-22,000001,Vente,405000,5018,,HAOURE,B029,32320,32326,Pouylebon,32,,,323260000A0097,,,,,,,,,,,,,0,2,Appartement,22,2,S,sols,,,689,0.31405,43.552364
2019-433446,2019-03-22,000001,Vente,405000,5018,,HAOURE,B029,32320,32326,Pouylebon,32,,,323260000A0097,,,,,,,,,,,,,0,2,Appartement,26,2,S,sols,,,689,0.31405,43.552364
2019-433446,2019-03-22,000001,Vente,405000,5018,,HAOURE,B029,32320,32326,Pouylebon,32,,,323260000A0097,,,,,,,,,,,,,0,1,Maison,168,5,S,sols,,,689,0.31405,43.552364
2019-433446,2019-03-22,000001,Vente,405000,5090,,HAOURE,B029,32320,32326,Pouylebon,32,,,323260000A0098,,,,,,,,,,,,,0,4,Local industriel. commercial ou assimilé,1000,0,S,sols,,,2500,0.313964,43.552055
2019-433446,2019-03-22,000001,Vente,405000,5090,,HAOURE,B029,32320,32326,Pouylebon,32,,,323260000A0098,,,,,,,,,,,,,0,4,Local industriel. commercial ou assimilé,1000,0,P,prés,,,7233,0.313964,43.552055
2019-433446,2019-03-22,000001,Vente,405000,,,PAGUERE DE CALABEL,B050,32320,32326,Pouylebon,32,,,323260000A0441,,,,,,,,,,,,,0,,,,,T,terres,,,8340,0.312506,43.552362
2019-433446,2019-03-22,000001,Vente,405000,,,PAGUERE DE CALABEL,B050,32320,32326,Pouylebon,32,,,323260000A0441,,,,,,,,,,,,,0,,,,,S,sols,,,1000,0.312506,43.552362
2019-433446,2019-03-22,000001,Vente,405000,,,PAGUERE DE CALABEL,B050,32320,32326,Pouylebon,32,,,323260000A0445,,,,,,,,,,,,,0,,,,,T,terres,,,3583,0.312936,43.551566
2019-433446,2019-03-22,000001,Vente,405000,,,PAGUERE DE CALABEL,B050,32320,32326,Pouylebon,32,,,323260000A0447,,,,,,,,,,,,,0,,,,,T,terres,,,911,0.311892,43.55217
2019-433734,2019-05-06,000001,Vente,203000,5215,,COSTES DE LAS BIASSES,B016,32320,32326,Pouylebon,32,,,323260000D0215,,,,,,,,,,,,,0,1,Maison,168,7,T,terres,,,1638,0.298536,43.549633
2019-433734,2019-05-06,000001,Vente,203000,5215,,COSTES DE LAS BIASSES,B016,32320,32326,Pouylebon,32,,,323260000D0215,,,,,,,,,,,,,0,1,Maison,168,7,S,sols,,,1500,0.298536,43.549633
2019-434100,2019-05-31,000001,Vente,95000,5026,,CURTET,B019,32320,32326,Pouylebon,32,,,323260000D0304,,,,,,,,,,,,,0,1,Maison,112,5,S,sols,,,1746,0.292627,43.538618
2019-434100,2019-05-31,000001,Vente,95000,,,BOSQ DOU JUGE,B007,32320,32326,Pouylebon,32,,,323260000D0309,,,,,,,,,,,,,0,,,,,BT,taillis simples,,,4286,0.292722,43.539554
2019-434100,2019-05-31,000001,Vente,95000,,,BOSQ DOU JUGE,B007,32320,32326,Pouylebon,32,,,323260000D0472,,,,,,,,,,,,,0,,,,,P,prés,,,707,0.293105,43.538398
2019-434100,2019-05-31,000001,Vente,95000,,,BOSQ DOU JUGE,B007,32320,32326,Pouylebon,32,,,323260000D0474,,,,,,,,,,,,,0,,,,,P,prés,,,9008,0.293324,43.539209
