id_mutation,date_mutation,numero_disposition,nature_mutation,valeur_fonciere,adresse_numero,adresse_suffixe,adresse_nom_voie,adresse_code_voie,code_postal,code_commune,nom_commune,code_departement,ancien_code_commune,ancien_nom_commune,id_parcelle,ancien_id_parcelle,numero_volume,lot1_numero,lot1_surface_carrez,lot2_numero,lot2_surface_carrez,lot3_numero,lot3_surface_carrez,lot4_numero,lot4_surface_carrez,lot5_numero,lot5_surface_carrez,nombre_lots,code_type_local,type_local,surface_reelle_bati,nombre_pieces_principales,code_nature_culture,nature_culture,code_nature_culture_speciale,nature_culture_speciale,surface_terrain,longitude,latitude
2019-472411,2019-02-12,000001,Vente,95000,197,,MICOULEAU,B019,33330,33546,Vignonet,33,,,33546000AB0068,,,,,,,,,,,,,0,1,Maison,42,3,S,sols,,,106,-0.146631,44.840823
2019-472411,2019-02-12,000001,Vente,95000,217,A,MICOULEAU,B019,33330,33546,Vignonet,33,,,33546000AB0101,,,,,,,,,,,,,0,3,Dépendance,,0,S,sols,,,23,-0.146693,44.841197
2019-472803,2019-03-20,000001,Vente,120000,,,PEYROUTAS,B023,33330,33546,Vignonet,33,,,33546000AH0112,,,,,,,,,,,,,0,,,,,S,sols,,,299,-0.1461,44.848996
2019-473634,2019-05-15,000001,Vente,193400,42,,PONTET,B026,33330,33546,Vignonet,33,,,33546000AD0331,,,,,,,,,,,,,0,1,Maison,111,4,S,sols,,,907,-0.162606,44.844918
2019-473634,2019-05-15,000001,Vente,193400,,,PONTET,B026,33330,33546,Vignonet,33,,,33546000AD0358,,,,,,,,,,,,,0,,,,,T,terres,,,216,-0.162707,44.845222
2019-473634,2019-05-15,000001,Vente,193400,,,PONTET,B026,33330,33546,Vignonet,33,,,33546000AD0359,,,,,,,,,,,,,0,,,,,T,terres,,,335,-0.162714,44.845053
2019-473908,2019-05-27,000001,Vente,323679,,,LABRIE   SUD,B038,33330,33546,Vignonet,33,,,33546000AD0128,,,,,,,,,,,,,0,,,,,VI,vignes,,,3412,-0.150722,44.851536
2019-473908,2019-05-27,000001,Vente,323679,,,LABRIE   SUD,B038,33330,33546,Vignonet,33,,,33546000AD0129,,,,,,,,,,,,,0,,,,,VI,vignes,,,2592,-0.151097,44.85145
2019-473908,2019-05-27,000001,Vente,323679,,,LABRIE   SUD,B038,33330,33546,Vignonet,33,,,33546000AD0130,,,,,,,,,,,,,0,,,,,VI,vignes,,,2498,-0.151693,44.851128
2019-473908,2019-05-27,000001,Vente,323679,,,LABRIE   SUD,B038,33330,33546,Vignonet,33,,,33546000AD0131,,,,,,,,,,,,,0,,,,,VI,vignes,,,1660,-0.15198,44.851324
2019-473908,2019-05-27,000001,Vente,323679,,,LABRIE   SUD,B038,33330,33546,Vignonet,33,,,33546000AD0137,,,,,,,,,,,,,0,,,,,VI,vignes,,,3086,-0.151078,44.851907
2019-473908,2019-05-27,000001,Vente,323679,,,LABRIE   SUD,B038,33330,33546,Vignonet,33,,,33546000AD0138,,,,,,,,,,,,,0,,,,,VI,vignes,,,1487,-0.150853,44.851838
2019-473908,2019-05-27,000001,Vente,323679,,,LABRIE   SUD,B038,33330,33546,Vignonet,33,,,33546000AD0378,,,,,,,,,,,,,0,,,,,VI,vignes,,,56,-0.151617,44.851679
2019-473908,2019-05-27,000001,Vente,323679,,,LABRIE   SUD,B038,33330,33546,Vignonet,33,,,33546000AD0380,,,,,,,,,,,,,0,,,,,VI,vignes,,,406,-0.151231,44.851994
2019-474245,2019-06-25,000001,Vente,370000,29,,LA GRAVE,B017,33330,33546,Vignonet,33,,,33546000AC0045,,,,,,,,,,,,,0,1,Maison,240,6,S,sols,,,819,-0.142271,44.844989
2019-474245,2019-06-25,000001,Vente,370000,,,LA GRAVE   SUD,B039,33330,33546,Vignonet,33,,,33546000AC0173,,,,,,,,,,,,,0,,,,,S,sols,,,796,,
2019-474245,2019-06-25,000001,Vente,370000,,,LA GRAVE   SUD,B039,33330,33546,Vignonet,33,,,33546000AC0177,,,,,,,,,,,,,0,,,,,VI,vignes,,,155,-0.142223,44.84535
2019-474552,2019-07-09,000001,Vente,153000,,,PEILLAN   OUEST,B040,33330,33546,Vignonet,33,,,33546000AE0149,,,,,,,,,,,,,0,,,,,VI,vignes,,,4554,-0.147187,44.853346
2019-474552,2019-07-09,000001,Vente,153000,,,PEILLAN   OUEST,B040,33330,33546,Vignonet,33,,,33546000AE0150,,,,,,,,,,,,,0,,,,,VI,vignes,,,1282,-0.147749,44.852541
2019-474552,2019-07-09,000001,Vente,153000,,,PEILLAN   OUEST,B040,33330,33546,Vignonet,33,,,33546000AE0150,,,,,,,,,,,,,0,,,,,T,terres,,,297,-0.147749,44.852541
2019-476501,2019-10-29,000002,Vente,100000,34,,BURLIS,B007,33330,33546,Vignonet,33,,,33546000AD0117,,,,,,,,,,,,,0,1,Maison,72,2,S,sols,,,857,-0.150909,44.84771
2019-476915,2019-11-21,000001,Vente,841008,,,PONTET,B026,33330,33546,Vignonet,33,,,33546000AD0264,,,,,,,,,,,,,0,,,,,VI,vignes,,,1092,-0.163303,44.845047
2019-476915,2019-11-21,000001,Vente,841008,,,PONTET,B026,33330,33546,Vignonet,33,,,33546000AD0265,,,,,,,,,,,,,0,,,,,VI,vignes,,,637,-0.163307,44.844955
2019-476915,2019-11-21,000001,Vente,841008,,,PONTET,B026,33330,33546,Vignonet,33,,,33546000AD0266,,,,,,,,,,,,,0,,,,,VI,vignes,,,2285,-0.16339,44.844794
2019-476915,2019-11-21,000001,Vente,841008,,,PONTET,B026,33330,33546,Vignonet,33,,,33546000AD0267,,,,,,,,,,,,,0,,,,,VI,vignes,,,1150,-0.163152,44.844641
2019-476915,2019-11-21,000001,Vente,841008,,,PONTET,B026,33330,33546,Vignonet,33,,,33546000AD0268,,,,,,,,,,,,,0,,,,,VI,vignes,,,5067,-0.163782,44.844549
2019-476915,2019-11-21,000001,Vente,841008,,,PONTET,B026,33330,33546,Vignonet,33,,,33546000AD0268,,,,,,,,,,,,,0,,,,,T,terres,,,2285,-0.163782,44.844549
2019-476915,2019-11-21,000001,Vente,841008,,,PONTET,B026,33330,33546,Vignonet,33,,,33546000AD0269,,,,,,,,,,,,,0,,,,,VI,vignes,,,1350,-0.164408,44.84411
2019-476915,2019-11-21,000001,Vente,841008,,,PONTET,B026,33330,33546,Vignonet,33,,,33546000AD0269,,,,,,,,,,,,,0,,,,,T,terres,,,443,-0.164408,44.84411
2019-476915,2019-11-21,000001,Vente,841008,,,PONTET,B026,33330,33546,Vignonet,33,,,33546000AD0273,,,,,,,,,,,,,0,,,,,T,terres,,,293,-0.165318,44.844246
2019-476915,2019-11-21,000001,Vente,841008,,,PONTET,B026,33330,33546,Vignonet,33,,,33546000AD0273,,,,,,,,,,,,,0,,,,,VI,vignes,,,2364,-0.165318,44.844246
2019-476915,2019-11-21,000001,Vente,841008,,,PONTET,B026,33330,33546,Vignonet,33,,,33546000AD0275,,,,,,,,,,,,,0,,,,,VI,vignes,,,1420,-0.165174,44.844655
2019-476915,2019-11-21,000001,Vente,841008,,,PONTET,B026,33330,33546,Vignonet,33,,,33546000AD0276,,,,,,,,,,,,,0,,,,,VI,vignes,,,2699,-0.16506,44.844856
2019-476915,2019-11-21,000001,Vente,841008,,,PONTET,B026,33330,33546,Vignonet,33,,,33546000AD0277,,,,,,,,,,,,,0,,,,,VI,vignes,,,2841,-0.165045,44.845116
2019-476915,2019-11-21,000001,Vente,841008,,,PONTET,B026,33330,33546,Vignonet,33,,,33546000AD0278,,,,,,,,,,,,,0,,,,,VI,vignes,,,2132,-0.164099,44.844973
2019-476915,2019-11-21,000001,Vente,841008,,,PONTET,B026,33330,33546,Vignonet,33,,,33546000AD0357,,,,,,,,,,,,,0,,,,,VI,vignes,,,2181,-0.16339,44.845376
2019-476915,2019-11-21,000001,Vente,841008,,,PONTET,B026,33330,33546,Vignonet,33,,,33546000AD0360,,,,,,,,,,,,,0,,,,,VI,vignes,,,901,-0.163404,44.84516
2019-477640,2019-12-17,000001,Vente,111110,,,PEYROUTAS   OUEST,B041,33330,33546,Vignonet,33,,,33546000AE0159,,,,,,,,,,,,,0,,,,,VI,vignes,,,1930,-0.146758,44.851745
2019-477640,2019-12-17,000001,Vente,111110,,,PEYROUTAS,B023,33330,33546,Vignonet,33,,,33546000AH0247,,,,,,,,,,,,,0,,,,,S,sols,,,476,-0.145298,44.849317
2019-477640,2019-12-17,000001,Vente,111110,,,PEYROUTAS,B023,33330,33546,Vignonet,33,,,33546000AH0247,,,,,,,,,,,,,0,,,,,VI,vignes,,,2036,-0.145298,44.849317
