id_mutation,date_mutation,numero_disposition,nature_mutation,valeur_fonciere,adresse_numero,adresse_suffixe,adresse_nom_voie,adresse_code_voie,code_postal,code_commune,nom_commune,code_departement,ancien_code_commune,ancien_nom_commune,id_parcelle,ancien_id_parcelle,numero_volume,lot1_numero,lot1_surface_carrez,lot2_numero,lot2_surface_carrez,lot3_numero,lot3_surface_carrez,lot4_numero,lot4_surface_carrez,lot5_numero,lot5_surface_carrez,nombre_lots,code_type_local,type_local,surface_reelle_bati,nombre_pieces_principales,code_nature_culture,nature_culture,code_nature_culture_speciale,nature_culture_speciale,surface_terrain,longitude,latitude
2019-510643,2019-07-23,000001,Vente,119000,,,LA GASQUE,B090,34210,34158,Minerve,34,,,341580000B0519,,,,,,,,,,,,,0,,,,,L,landes,,,875,2.737233,43.358662
2019-510643,2019-07-23,000001,Vente,119000,,,LA GASQUE,B090,34210,34158,Minerve,34,,,341580000B0520,,,,,,,,,,,,,0,,,,,L,landes,,,180,2.737417,43.358518
2019-510643,2019-07-23,000001,Vente,119000,5094,,LA GASQUE,B090,34210,34158,Minerve,34,,,341580000B0521,,,,,,,,,,,,,0,1,Maison,73,3,S,sols,,,585,2.737019,43.358423
2019-510643,2019-07-23,000001,Vente,119000,5094,,LA GASQUE,B090,34210,34158,Minerve,34,,,341580000B0521,,,,,,,,,,,,,0,1,Maison,73,3,T,terres,,,3370,2.737019,43.358423
2019-510643,2019-07-23,000001,Vente,119000,,,LA GASQUE,B090,34210,34158,Minerve,34,,,341580000B0522,,,,,,,,,,,,,0,,,,,L,landes,,,750,2.736684,43.358264
2019-510673,2019-08-02,000001,Vente,250000,,,LA GASQUE,B090,34210,34158,Minerve,34,,,341580000B0523,,,,,,,,,,,,,0,,,,,L,landes,,,1400,2.737463,43.357653
2019-510673,2019-08-02,000001,Vente,250000,7000,F,LA GASQUE,B090,34210,34158,Minerve,34,,,341580000B0524,,,,,,,,,,,,,0,1,Maison,200,4,S,sols,,,4800,2.737536,43.357935
2019-510673,2019-08-02,000001,Vente,250000,,,LA GASQUE,B090,34210,34158,Minerve,34,,,341580000B0525,,,,,,,,,,,,,0,,,,,L,landes,,,1200,2.737865,43.358162
2019-510777,2019-08-16,000001,Vente,70000,,,CHEMIN D AIGNE,B045,34210,34158,Minerve,34,,,341580000D0864,,,,,,,,,,,,,0,,,,,L,landes,,,2260,2.764937,43.342566
2019-510777,2019-08-16,000001,Vente,70000,,,CHEMIN D AIGNE,B045,34210,34158,Minerve,34,,,341580000D0865,,,,,,,,,,,,,0,,,,,L,landes,PATUR,Pâture plantée,1340,2.765154,43.342704
2019-510777,2019-08-16,000001,Vente,70000,,,GRANIES,B094,34210,34158,Minerve,34,,,341580000D0879,,,,,,,,,,,,,0,,,,,BT,taillis simples,CHVER,Chênes -verts,2950,2.763946,43.342155
2019-510777,2019-08-16,000001,Vente,70000,,,GRANIES,B094,34210,34158,Minerve,34,,,341580000D0886,,,,,,,,,,,,,0,,,,,VI,vignes,,,3370,2.767238,43.341478
2019-510777,2019-08-16,000001,Vente,70000,,,GRANIES,B094,34210,34158,Minerve,34,,,341580000D0886,,,,,,,,,,,,,0,,,,,VI,vignes,,,3370,2.767238,43.341478
2019-510777,2019-08-16,000001,Vente,70000,5102,,GRANIES,B094,34210,34158,Minerve,34,,,341580000D1055,,,,,,,,,,,,,0,1,Maison,85,3,S,sols,,,63,2.766535,43.341933
2019-510777,2019-08-16,000001,Vente,70000,1305,F,GRANIES,B094,34210,34158,Minerve,34,,,341580000D1305,,,,,,,,,,,,,0,1,Maison,87,3,S,sols,,,167,2.766568,43.341869
2019-510777,2019-08-16,000001,Vente,70000,,,GRANIES,B094,34210,34158,Minerve,34,,,341580000D1307,,,,,,,,,,,,,0,,,,,J,jardins,,,38,2.766462,43.341579
2019-510777,2019-08-16,000001,Vente,70000,,,GRANIES,B094,34210,34158,Minerve,34,,,341580000D1308,,,,,,,,,,,,,0,,,,,J,jardins,,,14,2.766549,43.341775
2019-510777,2019-08-16,000001,Vente,70000,,,GRANIES,B094,34210,34158,Minerve,34,,,341580000D1310,,,,,,,,,,,,,0,,,,,VI,vignes,,,211,2.766295,43.341658
2019-512639,2019-11-19,000001,Vente,45000,,,LA GASQUE,B090,34210,34158,Minerve,34,,,341580000B0527,,,,,,,,,,,,,0,,,,,T,terres,,,870,2.73865,43.356847
2019-512639,2019-11-19,000001,Vente,45000,,,LA GASQUE,B090,34210,34158,Minerve,34,,,341580000B0527,,,,,,,,,,,,,0,,,,,VI,vignes,,,12510,2.73865,43.356847
2019-512639,2019-11-19,000001,Vente,45000,,,LA GASQUE,B090,34210,34158,Minerve,34,,,341580000B0528,,,,,,,,,,,,,0,,,,,T,terres,,,2520,2.739402,43.356646
2019-512639,2019-11-19,000001,Vente,45000,,,BLASOI,B010,34210,34158,Minerve,34,,,341580000C0279,,,,,,,,,,,,,0,,,,,T,terres,,,4320,2.748821,43.35307
2019-512639,2019-11-19,000001,Vente,45000,,,BLASOI,B010,34210,34158,Minerve,34,,,341580000C0280,,,,,,,,,,,,,0,,,,,L,landes,,,750,2.748368,43.352417
2019-512639,2019-11-19,000001,Vente,45000,,,BLASOI,B010,34210,34158,Minerve,34,,,341580000C0281,,,,,,,,,,,,,0,,,,,T,terres,,,2890,2.748855,43.352542
2019-512639,2019-11-19,000001,Vente,45000,,,BLASOI,B010,34210,34158,Minerve,34,,,341580000C0282,,,,,,,,,,,,,0,,,,,L,landes,,,255,2.74933,43.352603
2019-512639,2019-11-19,000001,Vente,45000,,,BLASOI,B010,34210,34158,Minerve,34,,,341580000C0283,,,,,,,,,,,,,0,,,,,VI,vignes,,,6900,2.74923,43.351898
2019-512639,2019-11-19,000001,Vente,45000,,,BLASOI,B010,34210,34158,Minerve,34,,,341580000C0283,,,,,,,,,,,,,0,,,,,T,terres,,,6000,2.74923,43.351898
2019-512639,2019-11-19,000001,Vente,45000,,,BLASOI,B010,34210,34158,Minerve,34,,,341580000C0290,,,,,,,,,,,,,0,,,,,VI,vignes,,,2310,2.751401,43.351533
2019-512639,2019-11-19,000001,Vente,45000,,,BLASOI,B010,34210,34158,Minerve,34,,,341580000C0294,,,,,,,,,,,,,0,,,,,VI,vignes,,,2880,2.751999,43.351381
2019-512639,2019-11-19,000001,Vente,45000,,,L ESTRADE,B081,34210,34158,Minerve,34,,,341580000C0331,,,,,,,,,,,,,0,,,,,VI,vignes,,,9100,2.748732,43.354529
2019-512639,2019-11-19,000001,Vente,45000,,,L ESTRADE,B081,34210,34158,Minerve,34,,,341580000C0331,,,,,,,,,,,,,0,,,,,VI,vignes,,,4550,2.748732,43.354529
2019-512639,2019-11-19,000001,Vente,45000,,,L ESTRADE,B081,34210,34158,Minerve,34,,,341580000C0334,,,,,,,,,,,,,0,,,,,L,landes,PATUR,Pâture plantée,255,2.747963,43.354817
2019-512639,2019-11-19,000001,Vente,45000,,,CROIX BLANCHE,B073,34210,34158,Minerve,34,,,341580000D0103,,,,,,,,,,,,,0,,,,,T,terres,,,2300,2.741522,43.343202
2019-512639,2019-11-19,000001,Vente,45000,,,CROIX BLANCHE,B073,34210,34158,Minerve,34,,,341580000D0103,,,,,,,,,,,,,0,,,,,T,terres,,,2300,2.741522,43.343202
2019-512639,2019-11-19,000001,Vente,45000,,,CROIX BLANCHE,B073,34210,34158,Minerve,34,,,341580000D0104,,,,,,,,,,,,,0,,,,,T,terres,,,1233,2.742242,43.343285
2019-512639,2019-11-19,000001,Vente,45000,,,CROIX BLANCHE,B073,34210,34158,Minerve,34,,,341580000D0104,,,,,,,,,,,,,0,,,,,T,terres,,,8297,2.742242,43.343285
2019-512641,2019-11-19,000001,Vente,22000,,,COUSSALS,B072,34210,34158,Minerve,34,,,341580000D0362,,,,,,,,,,,,,0,,,,,T,terres,,,2600,2.736851,43.346073
2019-512641,2019-11-19,000001,Vente,22000,,,COUSSALS,B072,34210,34158,Minerve,34,,,341580000D0363,,,,,,,,,,,,,0,,,,,T,terres,,,830,2.736953,43.345603
2019-512641,2019-11-19,000001,Vente,22000,,,COUSSALS,B072,34210,34158,Minerve,34,,,341580000D0364,,,,,,,,,,,,,0,,,,,T,terres,,,295,2.737005,43.345316
2019-512641,2019-11-19,000001,Vente,22000,,,COUSSALS,B072,34210,34158,Minerve,34,,,341580000D0381,,,,,,,,,,,,,0,,,,,T,terres,,,660,2.737348,43.344989
2019-512641,2019-11-19,000001,Vente,22000,,,COUSSALS,B072,34210,34158,Minerve,34,,,341580000D0382,,,,,,,,,,,,,0,,,,,VI,vignes,,,8130,2.737481,43.345419
2019-512641,2019-11-19,000001,Vente,22000,,,COUSSALS,B072,34210,34158,Minerve,34,,,341580000D0382,,,,,,,,,,,,,0,,,,,T,terres,,,3900,2.737481,43.345419
2019-512641,2019-11-19,000001,Vente,22000,,,COUSSALS,B072,34210,34158,Minerve,34,,,341580000D0383,,,,,,,,,,,,,0,,,,,T,terres,,,245,2.737941,43.345829
2019-512641,2019-11-19,000001,Vente,22000,,,CAMP D AZILLANET,B024,34210,34158,Minerve,34,,,341580000D1265,,,,,,,,,,,,,0,,,,,VI,vignes,,,132,2.735864,43.34465
2019-512641,2019-11-19,000001,Vente,22000,,,COUSSALS,B072,34210,34158,Minerve,34,,,341580000D1267,,,,,,,,,,,,,0,,,,,VI,vignes,,,4495,2.735838,43.344203
2019-512641,2019-11-19,000001,Vente,22000,,,COUSSALS,B072,34210,34158,Minerve,34,,,341580000D1268,,,,,,,,,,,,,0,,,,,VI,vignes,,,351,2.736139,43.344175
2019-512641,2019-11-19,000001,Vente,22000,,,COUSSALS,B072,34210,34158,Minerve,34,,,341580000D1274,,,,,,,,,,,,,0,,,,,VI,vignes,,,3081,2.736157,43.344805
2019-512641,2019-11-19,000001,Vente,22000,,,COUSSALS,B072,34210,34158,Minerve,34,,,341580000D1278,,,,,,,,,,,,,0,,,,,VI,vignes,,,1060,2.736417,43.345388
