id_mutation,date_mutation,numero_disposition,nature_mutation,valeur_fonciere,adresse_numero,adresse_suffixe,adresse_nom_voie,adresse_code_voie,code_postal,code_commune,nom_commune,code_departement,ancien_code_commune,ancien_nom_commune,id_parcelle,ancien_id_parcelle,numero_volume,lot1_numero,lot1_surface_carrez,lot2_numero,lot2_surface_carrez,lot3_numero,lot3_surface_carrez,lot4_numero,lot4_surface_carrez,lot5_numero,lot5_surface_carrez,nombre_lots,code_type_local,type_local,surface_reelle_bati,nombre_pieces_principales,code_nature_culture,nature_culture,code_nature_culture_speciale,nature_culture_speciale,surface_terrain,longitude,latitude
2019-540976,2019-01-14,000001,Vente,8449.57,,,LA GRANDE EPINE,B460,35120,35010,Baguer-Pican,35,,,350100000C0276,,,,,,,,,,,,,0,,,,,T,terres,,,8560,-1.676062,48.532018
2019-540976,2019-01-14,000001,Vente,8449.57,,,LE CLOS NEUF,B296,35120,35010,Baguer-Pican,35,,,350100000C0283,,,,,,,,,,,,,0,,,,,T,terres,,,14180,-1.675172,48.530888
2019-541342,2019-02-04,000001,Vente,4090,,,LAUNAY LABBE,B543,35120,35010,Baguer-Pican,35,,,350100000A0316,,,,,,,,,,,,,0,,,,,P,prés,,,6288,-1.702133,48.570395
2019-541342,2019-02-04,000001,Vente,4090,,,LAUNAY LABBE,B543,35120,35010,Baguer-Pican,35,,,350100000A0924,,,,,,,,,,,,,0,,,,,L,landes,,,162,-1.70158,48.570257
2019-541389,2019-02-02,000001,Vente,183000,,,LE GRAND NATAY,B447,35120,35010,Baguer-Pican,35,,,350100000D0144,,,,,,,,,,,,,0,,,,,P,prés,,,3425,-1.710135,48.543942
2019-541389,2019-02-02,000001,Vente,183000,,,PONT GALOU,B723,35120,35010,Baguer-Pican,35,,,350100000D0152,,,,,,,,,,,,,0,,,,,J,jardins,POTAG,Jardin potager,480,-1.709724,48.544229
2019-541389,2019-02-02,000001,Vente,183000,5206,,PONT GALOU,B723,35120,35010,Baguer-Pican,35,,,350100000D0153,,,,,,,,,,,,,0,1,Maison,120,4,S,sols,,,1270,-1.709786,48.544373
2019-541435,2019-01-16,000002,Vente,115000,,,LA HAUTE ROCHE,B495,35120,35010,Baguer-Pican,35,,,350100000A0441,,,,,,,,,,,,,0,,,,,S,sols,,,25,-1.711177,48.562472
2019-541435,2019-01-16,000002,Vente,115000,,,LA HAUTE ROCHE,B495,35120,35010,Baguer-Pican,35,,,350100000A1124,,,,,,,,,,,,,0,,,,,P,prés,,,5104,-1.711306,48.562466
2019-541435,2019-01-16,000002,Vente,115000,,,LA HAUTE ROCHE,B495,35120,35010,Baguer-Pican,35,,,350100000A1221,,,,,,,,,,,,,0,,,,,S,sols,,,900,-1.711521,48.56216
2019-541435,2019-01-16,000002,Vente,115000,,,LA HAUTE ROCHE,B495,35120,35010,Baguer-Pican,35,,,350100000A1222,,,,,,,,,,,,,0,,,,,S,sols,,,146,-1.711429,48.561821
2019-541435,2019-01-16,000002,Vente,115000,,,LA HAUTE ROCHE,B495,35120,35010,Baguer-Pican,35,,,350100000A1224,,,,,,,,,,,,,0,,,,,T,terres,,,484,-1.711031,48.562273
2019-541435,2019-01-16,000002,Vente,115000,,,LA HAUTE ROCHE,B495,35120,35010,Baguer-Pican,35,,,350100000A1226,,,,,,,,,,,,,0,,,,,S,sols,,,389,-1.711376,48.561983
2019-541506,2019-02-12,000001,Vente,25650,,,LA FOUGERAY,B411,35120,35010,Baguer-Pican,35,,,35010000ZC0174,,,,,,,,,,,,,0,,,,,AB,terrains a bâtir,,,513,-1.700925,48.555106
2019-541510,2019-02-13,000002,Vente,4800,,,LOUMART,B552,35120,35010,Baguer-Pican,35,,,350100000D1292,,,,,,,,,,,,,0,,,,,T,terres,,,119,-1.721966,48.544997
2019-541629,2019-02-19,000001,Vente,21380.1,,,LE BERJAL,B037,35120,35010,Baguer-Pican,35,,,350100000A0617,,,,,,,,,,,,,0,,,,,P,prés,,,4820,-1.715424,48.562862
2019-541629,2019-02-19,000001,Vente,21380.1,,,LA BOUCANNERIE,B058,35120,35010,Baguer-Pican,35,,,350100000A0657,,,,,,,,,,,,,0,,,,,P,prés,,,6550,-1.714975,48.563731
2019-541629,2019-02-19,000001,Vente,21380.1,,,LA GRANDE BECANNERIE,B457,35120,35010,Baguer-Pican,35,,,350100000A0706,,,,,,,,,,,,,0,,,,,T,terres,,,7488,-1.714654,48.562906
2019-541660,2019-02-21,000001,Vente,80000,13,,RUE DE PARIS,0044,35120,35010,Baguer-Pican,35,,,35010000AB0015,,,,,,,,,,,,,0,1,Maison,77,4,S,sols,,,448,-1.701119,48.553082
2019-541660,2019-02-21,000001,Vente,80000,,,LA RUE DU PUITS,B794,35120,35010,Baguer-Pican,35,,,35010000AB0511,,,,,,,,,,,,,0,,,,,T,terres,,,84,-1.701133,48.553262
2019-541660,2019-02-21,000001,Vente,80000,,,LA RUE DU PUITS,B794,35120,35010,Baguer-Pican,35,,,35010000AB0512,,,,,,,,,,,,,0,,,,,T,terres,,,86,-1.701313,48.553242
2019-541668,2019-02-19,000001,Vente,40000,,,LA CHATAIGNERAIE,B139,35120,35010,Baguer-Pican,35,,,350100000C0352,,,,,,,,,,,,,0,,,,,P,prés,,,1535,-1.668625,48.530337
2019-541668,2019-02-19,000001,Vente,40000,5344,,LA DIOLAIS,B371,35120,35010,Baguer-Pican,35,,,350100000C0353,,,,,,,,,,,,,0,1,Maison,36,1,S,sols,,,105,-1.668904,48.530103
2019-541668,2019-02-19,000001,Vente,40000,,,LA DIOLAIS,B371,35120,35010,Baguer-Pican,35,,,350100000C0354,,,,,,,,,,,,,0,,,,,P,prés,,,635,-1.668797,48.529986
2019-541885,2019-03-08,000001,Vente,1,,,VIENNE,B865,35120,35010,Baguer-Pican,35,,,350100000D0940,,,,,,,,,,,,,0,,,,,S,sols,,,139,-1.708437,48.543502
2019-541898,2019-01-18,000001,Vente,1500,,,LA HAUTE ROCHE,B495,35120,35010,Baguer-Pican,35,,,350100000A1130,,,,,,,,,,,,,0,,,,,T,terres,,,179,-1.711041,48.561975
2019-541898,2019-01-18,000001,Vente,1500,,,LA HAUTE ROCHE,B495,35120,35010,Baguer-Pican,35,,,350100000A1223,,,,,,,,,,,,,0,,,,,T,terres,,,107,-1.711024,48.562021
2019-541898,2019-01-18,000001,Vente,1500,,,LA HAUTE ROCHE,B495,35120,35010,Baguer-Pican,35,,,350100000A1225,,,,,,,,,,,,,0,,,,,S,sols,,,14,-1.711146,48.56202
2019-541936,2019-03-14,000001,Vente,145000,10,,LA HAIRIERE,B489,35120,35010,Baguer-Pican,35,,,350100000C0496,,,,,,,,,,,,,0,1,Maison,140,6,S,sols,,,575,-1.685328,48.532439
2019-541966,2019-04-03,000002,Vente,40000,,,LA FOUGERAY,B411,35120,35010,Baguer-Pican,35,,,35010000ZC0191,,,,,,,,,,,,,0,,,,,T,terres,,,1022,-1.694987,48.55629
2019-542042,2019-04-03,000002,Vente,2550,,,LE PETIT HAUDIER,B645,35120,35010,Baguer-Pican,35,,,350100000B0485,,,,,,,,,,,,,0,,,,,P,prés,,,2010,-1.663255,48.552675
2019-542042,2019-04-03,000002,Vente,2550,,,LE CHAMP DE LA PLANCHE,B102,35120,35010,Baguer-Pican,35,,,350100000B0970,,,,,,,,,,,,,0,,,,,T,terres,,,1432,-1.664126,48.552778
2019-542042,2019-04-03,000002,Vente,2550,,,LE CHAMP DE LA PLANCHE,B102,35120,35010,Baguer-Pican,35,,,350100000B0971,,,,,,,,,,,,,0,,,,,T,terres,,,2118,-1.663706,48.552738
2019-542541,2019-04-26,000001,Vente,160000,2,,RUE DES MASSES,0037,35120,35010,Baguer-Pican,35,,,35010000AB0401,,,,,,,,,,,,,0,1,Maison,146,5,S,sols,,,771,-1.702644,48.552215
2019-542842,2019-05-16,000001,Vente,33500,,,PEAN,B701,35120,35010,Baguer-Pican,35,,,350100000A0361,,,,,,,,,,,,,0,,,,,T,terres,,,3400,-1.697564,48.573344
2019-542842,2019-05-16,000001,Vente,33500,55,,PEAN,B701,35120,35010,Baguer-Pican,35,,,350100000A0982,,,,,,,,,,,,,0,1,Maison,38,1,S,sols,,,869,-1.697366,48.572922
2019-543079,2019-05-28,000001,Vente,219000,68,B,LE BAS TROHEL,B024,35120,35010,Baguer-Pican,35,,,350100000B0845,,,,,,,,,,,,,0,1,Maison,163,6,AG,terrains d'agrément,,,883,-1.667281,48.557341
2019-543079,2019-05-28,000001,Vente,219000,68,B,LE BAS TROHEL,B024,35120,35010,Baguer-Pican,35,,,350100000B0845,,,,,,,,,,,,,0,1,Maison,163,6,S,sols,,,500,-1.667281,48.557341
2019-543116,2019-05-29,000002,Vente,700,,,LA HAIRIERE,B489,35120,35010,Baguer-Pican,35,,,350100000C1229,,,,,,,,,,,,,0,,,,,S,sols,,,36,-1.683737,48.530996
2019-543120,2019-05-02,000001,Vente,544723,61,B,PONT GALOU,B723,35120,35010,Baguer-Pican,35,,,350100000D1272,,,,,,,,,,,,,0,1,Maison,309,7,AG,terrains d'agrément,,,3976,-1.710825,48.545829
2019-543120,2019-05-02,000001,Vente,544723,61,B,PONT GALOU,B723,35120,35010,Baguer-Pican,35,,,350100000D1272,,,,,,,,,,,,,0,1,Maison,309,7,S,sols,,,1200,-1.710825,48.545829
2019-543120,2019-05-02,000001,Vente,544723,,,PONT GALOU,B723,35120,35010,Baguer-Pican,35,,,350100000D1275,,,,,,,,,,,,,0,,,,,S,sols,,,361,-1.709522,48.54583
2019-543280,2019-06-11,000001,Vente,45000,3,,RUE DU PUITS,0048,35120,35010,Baguer-Pican,35,,,35010000AB0124,,,,,,,,,,,,,0,1,Maison,62,2,S,sols,,,384,-1.697374,48.55269
2019-543280,2019-06-11,000001,Vente,45000,,,RUE DU PUITS,0048,35120,35010,Baguer-Pican,35,,,35010000AB0125,,,,,,,,,,,,,0,,,,,S,sols,,,122,-1.697418,48.552601
2019-543280,2019-06-11,000001,Vente,45000,,,LE BOURG,B063,35120,35010,Baguer-Pican,35,,,35010000AB0126,,,,,,,,,,,,,0,,,,,J,jardins,POTAG,Jardin potager,350,-1.697635,48.552695
2019-543280,2019-06-11,000001,Vente,45000,,,LE BOURG,B063,35120,35010,Baguer-Pican,35,,,35010000AB0127,,,,,,,,,,,,,0,,,,,S,sols,,,8,-1.697807,48.55277
2019-543432,2019-06-11,000001,Vente,137000,,,LA HAIRIERE,B489,35120,35010,Baguer-Pican,35,,,350100000C0686,,,,,,,,,,,,,0,,,,,S,sols,,,113,-1.683827,48.531339
2019-543432,2019-06-11,000001,Vente,137000,5171,,LA HAIRIERE,B489,35120,35010,Baguer-Pican,35,,,350100000C1228,,,,,,,,,,,,,0,1,Maison,104,3,S,sols,,,584,-1.683661,48.531095
2019-543440,2019-06-20,000001,Vente,5200,,,LES TERTRES DES BEAUDOUINS,B823,35120,35010,Baguer-Pican,35,,,350100000A1004,,,,,,,,,,,,,0,,,,,BT,taillis simples,,,3199,-1.693262,48.57338
2019-543507,2019-07-05,000001,Vente,130000,17,B,LA HAIRIERE,B489,35120,35010,Baguer-Pican,35,,,350100000C0513,,,,,,,,,,,,,0,1,Maison,110,4,S,sols,,,460,-1.683385,48.531143
2019-543507,2019-07-05,000001,Vente,130000,,,LE PETIT PRE,B648,35120,35010,Baguer-Pican,35,,,350100000C1084,,,,,,,,,,,,,0,,,,,P,prés,,,1445,-1.683469,48.5306
2019-543536,2019-07-04,000001,Vente,180000,11,,RUE DES MASSES,0037,35120,35010,Baguer-Pican,35,,,35010000AB0394,,,,,,,,,,,,,0,1,Maison,92,4,S,sols,,,631,-1.702605,48.55115
2019-543667,2019-07-05,000003,Vente,256505.7,,,LA JANNAIE,B511,35120,35010,Baguer-Pican,35,,,350100000D1330,,,,,,,,,,,,,0,,,,,P,prés,,,5889,-1.716338,48.549309
2019-543667,2019-07-05,000003,Vente,256505.7,,,LA JANNAIE,B511,35120,35010,Baguer-Pican,35,,,350100000D1331,,,,,,,,,,,,,0,,,,,T,terres,,,1051,-1.71608,48.549629
2019-543667,2019-07-05,000003,Vente,256505.7,,,LE TRAVERSIN,B826,35120,35010,Baguer-Pican,35,,,350100000D1334,,,,,,,,,,,,,0,,,,,S,sols,,,1434,-1.715897,48.547894
2019-543667,2019-07-05,000003,Vente,256505.7,,,LA JANNAIE,B511,35120,35010,Baguer-Pican,35,,,350100000D1337,,,,,,,,,,,,,0,,,,,T,terres,,,999,-1.717564,48.549061
2019-543667,2019-07-05,000003,Vente,256505.7,,,LE TAILLIS,B811,35120,35010,Baguer-Pican,35,,,350100000D1340,,,,,,,,,,,,,0,,,,,T,terres,,,6735,-1.716387,48.548886
2019-543667,2019-07-05,000003,Vente,256505.7,,,LA JANNAIE,B511,35120,35010,Baguer-Pican,35,,,350100000D1342,,,,,,,,,,,,,0,,,,,T,terres,,,3051,-1.716478,48.548321
2019-543667,2019-07-05,000003,Vente,256505.7,,,LA JANNAIE,B511,35120,35010,Baguer-Pican,35,,,350100000D1344,,,,,,,,,,,,,0,,,,,T,terres,,,1943,-1.716269,48.548555
2019-543667,2019-07-05,000003,Vente,256505.7,,,LE TRAVERSIN,B826,35120,35010,Baguer-Pican,35,,,350100000D1346,,,,,,,,,,,,,0,,,,,T,terres,,,1283,-1.716197,48.548134
2019-543785,2019-07-12,000001,Vente,27192.2,,,LA CROIX DE LAUNAY,B357,35120,35010,Baguer-Pican,35,,,35010000ZA0029,,,,,,,,,,,,,0,,,,,T,terres,,,5530,-1.708195,48.560192
2019-543785,2019-07-12,000001,Vente,27192.2,,,LA CROIX DE LAUNAY,B357,35120,35010,Baguer-Pican,35,,,35010000ZA0147,,,,,,,,,,,,,0,,,,,T,terres,,,10000,-1.708209,48.560698
2019-543790,2019-07-09,000002,Vente,1940,,,LE GRAND VERGER,B455,35120,35010,Baguer-Pican,35,,,350100000D1261,,,,,,,,,,,,,0,,,,,S,sols,,,97,-1.712629,48.545563
2019-543800,2019-07-05,000001,Vente,256505.7,,,LA JANNAIE,B511,35120,35010,Baguer-Pican,35,,,350100000D1330,,,,,,,,,,,,,0,,,,,P,prés,,,5889,-1.716338,48.549309
2019-543800,2019-07-05,000001,Vente,256505.7,,,LA JANNAIE,B511,35120,35010,Baguer-Pican,35,,,350100000D1331,,,,,,,,,,,,,0,,,,,T,terres,,,1051,-1.71608,48.549629
2019-543800,2019-07-05,000001,Vente,256505.7,,,LE TRAVERSIN,B826,35120,35010,Baguer-Pican,35,,,350100000D1334,,,,,,,,,,,,,0,,,,,S,sols,,,1434,-1.715897,48.547894
2019-543800,2019-07-05,000001,Vente,256505.7,,,LA JANNAIE,B511,35120,35010,Baguer-Pican,35,,,350100000D1337,,,,,,,,,,,,,0,,,,,T,terres,,,999,-1.717564,48.549061
2019-543800,2019-07-05,000001,Vente,256505.7,,,LE TAILLIS,B811,35120,35010,Baguer-Pican,35,,,350100000D1340,,,,,,,,,,,,,0,,,,,T,terres,,,6735,-1.716387,48.548886
2019-543800,2019-07-05,000001,Vente,256505.7,,,LA JANNAIE,B511,35120,35010,Baguer-Pican,35,,,350100000D1342,,,,,,,,,,,,,0,,,,,T,terres,,,3051,-1.716478,48.548321
2019-543800,2019-07-05,000001,Vente,256505.7,,,LA JANNAIE,B511,35120,35010,Baguer-Pican,35,,,350100000D1344,,,,,,,,,,,,,0,,,,,T,terres,,,1943,-1.716269,48.548555
2019-543800,2019-07-05,000001,Vente,256505.7,,,LE TRAVERSIN,B826,35120,35010,Baguer-Pican,35,,,350100000D1346,,,,,,,,,,,,,0,,,,,T,terres,,,1283,-1.716197,48.548134
2019-543854,2019-07-15,000001,Vente,210000,36,,RUE DE PARIS,0044,35120,35010,Baguer-Pican,35,,,350100000C0972,,,,,,,,,,,,,0,1,Maison,161,6,AG,terrains d'agrément,,,500,-1.691603,48.553427
2019-543854,2019-07-15,000001,Vente,210000,36,,RUE DE PARIS,0044,35120,35010,Baguer-Pican,35,,,350100000C0972,,,,,,,,,,,,,0,1,Maison,161,6,S,sols,,,543,-1.691603,48.553427
2019-543854,2019-07-15,000001,Vente,210000,,,LE TERTRE,B818,35120,35010,Baguer-Pican,35,,,350100000C0975,,,,,,,,,,,,,0,,,,,AG,terrains d'agrément,,,298,-1.691489,48.553382
2019-543858,2019-07-09,000001,Vente,94000,5199,,BELLEVUE,B035,35120,35010,Baguer-Pican,35,,,350100000D1260,,,,,,,,,,,,,0,1,Maison,83,6,S,sols,,,1186,-1.71238,48.545461
2019-544098,2019-07-17,000002,Vente,106560,,,LE CLOS DES POIRIERS,B267,35120,35010,Baguer-Pican,35,,,35010000AB0520,,,,,,,,,,,,,0,,,,,T,terres,,,2880,-1.697929,48.554152
2019-544145,2019-07-29,000001,Vente,12300,,,LE LARGE DE LA LANDELLE,B540,35120,35010,Baguer-Pican,35,,,350100000D0422,,,,,,,,,,,,,0,,,,,P,prés,,,10535,-1.702205,48.536302
2019-544145,2019-07-29,000001,Vente,12300,,,LE LONG,B547,35120,35010,Baguer-Pican,35,,,350100000D0430,,,,,,,,,,,,,0,,,,,T,terres,,,7200,-1.699907,48.53616
2019-544145,2019-07-29,000001,Vente,12300,,,LE LONG,B547,35120,35010,Baguer-Pican,35,,,350100000D0431,,,,,,,,,,,,,0,,,,,T,terres,,,7230,-1.700013,48.536569
2019-544145,2019-07-29,000001,Vente,12300,,,LES MOINES,B571,35120,35010,Baguer-Pican,35,,,350100000D0433,,,,,,,,,,,,,0,,,,,T,terres,,,13130,-1.700407,48.537188
2019-544145,2019-07-29,000001,Vente,12300,,,LA MOIGNERAIS,B879,35120,35010,Baguer-Pican,35,,,350100000D0484,,,,,,,,,,,,,0,,,,,P,prés,,,3040,-1.706693,48.53942
2019-544232,2019-08-02,000002,Vente,53950,,,LA GOUPILLIERE,B426,35120,35010,Baguer-Pican,35,,,350100000A1207,,,,,,,,,,,,,0,,,,,AB,terrains a bâtir,,,86,-1.71287,48.562514
2019-544232,2019-08-02,000002,Vente,53950,,,LA GOUPILLIERE,B426,35120,35010,Baguer-Pican,35,,,350100000A1211,,,,,,,,,,,,,0,,,,,AB,terrains a bâtir,,,145,-1.712527,48.562687
2019-544232,2019-08-02,000002,Vente,53950,,,LA HAUTE ROCHE,B495,35120,35010,Baguer-Pican,35,,,350100000A1213,,,,,,,,,,,,,0,,,,,AB,terrains a bâtir,,,739,-1.71258,48.562529
2019-544232,2019-08-02,000002,Vente,53950,,,LA HAUTE ROCHE,B495,35120,35010,Baguer-Pican,35,,,350100000A1215,,,,,,,,,,,,,0,,,,,T,terres,,,99,-1.712661,48.562398
2019-544232,2019-08-02,000002,Vente,53950,,,LA GOUPILLIERE,B426,35120,35010,Baguer-Pican,35,,,350100000A1227,,,,,,,,,,,,,0,,,,,T,terres,,,113,-1.712434,48.562729
2019-544232,2019-08-02,000002,Vente,53950,,,LA HAUTE ROCHE,B495,35120,35010,Baguer-Pican,35,,,350100000A1229,,,,,,,,,,,,,0,,,,,T,terres,,,87,-1.712311,48.56264
2019-544233,2019-07-31,000001,Vente,25000,,,LE GRAND COURTIL,B437,35120,35010,Baguer-Pican,35,,,350100000B0957,,,,,,,,,,,,,0,,,,,AB,terrains a bâtir,,,1071,-1.663206,48.558146
2019-544240,2019-08-05,000001,Vente,190000,,,PEAN,B701,35120,35010,Baguer-Pican,35,,,350100000A0348,,,,,,,,,,,,,0,,,,,T,terres,,,1170,-1.699904,48.573283
2019-544240,2019-08-05,000001,Vente,190000,52,,PEAN,B701,35120,35010,Baguer-Pican,35,,,350100000A0349,,,,,,,,,,,,,0,1,Maison,150,3,S,sols,,,1350,-1.69963,48.573131
2019-544240,2019-08-05,000001,Vente,190000,,,CHEMIN DE PIAN,B164,35120,35010,Baguer-Pican,35,,,350100000A0350,,,,,,,,,,,,,0,,,,,T,terres,,,250,-1.699295,48.572712
2019-544240,2019-08-05,000001,Vente,190000,,,PEAN,B701,35120,35010,Baguer-Pican,35,,,350100000A0351,,,,,,,,,,,,,0,,,,,P,prés,,,1240,-1.699095,48.57282
2019-544240,2019-08-05,000001,Vente,190000,,,LA SAUDRAIS,B802,35120,35010,Baguer-Pican,35,,,350100000A0352,,,,,,,,,,,,,0,,,,,P,prés,,,1458,-1.698736,48.572932
2019-544240,2019-08-05,000001,Vente,190000,,,PEAN,B701,35120,35010,Baguer-Pican,35,,,350100000A0353,,,,,,,,,,,,,0,,,,,P,prés,,,2270,-1.699245,48.573336
2019-544240,2019-08-05,000001,Vente,190000,,,PEAN,B701,35120,35010,Baguer-Pican,35,,,350100000A0353,,,,,,,,,,,,,0,,,,,P,prés,,,2610,-1.699245,48.573336
2019-544243,2019-08-07,000001,Vente,15900,,,LE CLOS SUR LES PRES,B307,35120,35010,Baguer-Pican,35,,,350100000A0293,,,,,,,,,,,,,0,,,,,T,terres,,,26540,-1.702844,48.568944
2019-544392,2019-08-16,000001,Vente,110000,5018,,LA HAUTE ROCHE,B495,35120,35010,Baguer-Pican,35,,,350100000A0646,,,,,,,,,,,,,0,1,Maison,80,1,S,sols,,,210,-1.713136,48.561834
2019-544392,2019-08-16,000001,Vente,110000,,,LA HAUTE ROCHE,B495,35120,35010,Baguer-Pican,35,,,350100000A0651,,,,,,,,,,,,,0,,,,,J,jardins,POTAG,Jardin potager,660,-1.713318,48.561975
2019-544563,2019-09-03,000001,Vente,6000,,,LES BAS CHAMPS,B019,35120,35010,Baguer-Pican,35,,,350100000C0466,,,,,,,,,,,,,0,,,,,T,terres,,,10810,-1.678611,48.534567
2019-544563,2019-09-03,000001,Vente,6000,,,LA LANDE,B525,35120,35010,Baguer-Pican,35,,,350100000C0791,,,,,,,,,,,,,0,,,,,T,terres,,,5120,-1.684593,48.538608
2019-544575,2019-09-03,000001,Vente,1200,,,LA PIERRE,B708,35120,35010,Baguer-Pican,35,,,350100000C0153,,,,,,,,,,,,,0,,,,,T,terres,,,3145,-1.660158,48.545289
2019-544683,2019-09-09,000002,Vente,500,,,TAILLIS DU ROCHER,B813,35120,35010,Baguer-Pican,35,,,350100000C1226,,,,,,,,,,,,,0,,,,,S,sols,,,207,-1.691823,48.555221
2019-544683,2019-09-09,000003,Vente,500,,,TAILLIS DU ROCHER,B813,35120,35010,Baguer-Pican,35,,,350100000C1227,,,,,,,,,,,,,0,,,,,S,sols,,,207,-1.692216,48.555189
2019-544688,2019-09-09,000001,Vente,62000,,,TAILLIS DU ROCHER,B813,35120,35010,Baguer-Pican,35,,,350100000C1224,,,,,,,,,,,,,0,,,,,AB,terrains a bâtir,,,900,-1.692721,48.554935
2019-544688,2019-09-09,000001,Vente,62000,,,TAILLIS DU ROCHER,B813,35120,35010,Baguer-Pican,35,,,350100000C1225,,,,,,,,,,,,,0,,,,,AB,terrains a bâtir,,,653,-1.692369,48.554935
2019-544799,2019-09-27,000001,Vente,112000,41,,RUE DE PARIS,0044,35120,35010,Baguer-Pican,35,,,35010000AB0058,,,,,,,,,,,,,0,3,Dépendance,,0,S,sols,,,212,,
2019-544799,2019-09-27,000001,Vente,112000,41,,RUE DE PARIS,0044,35120,35010,Baguer-Pican,35,,,35010000AB0058,,,,,,,,,,,,,0,1,Maison,122,4,S,sols,,,212,,
2019-544799,2019-09-27,000001,Vente,112000,,,RUE DE PARIS,0044,35120,35010,Baguer-Pican,35,,,35010000AB0059,,,,,,,,,,,,,0,,,,,J,jardins,POTAG,Jardin potager,712,,
2019-544830,2019-09-16,000001,Vente,142500,1,,RUE DES ROSIERS,0054,35120,35010,Baguer-Pican,35,,,35010000AB0254,,,,,,,,,,,,,0,1,Maison,92,4,S,sols,,,500,-1.698855,48.55201
2019-544830,2019-09-16,000001,Vente,142500,1,,RUE DES ROSIERS,0054,35120,35010,Baguer-Pican,35,,,35010000AB0254,,,,,,,,,,,,,0,1,Maison,92,4,AG,terrains d'agrément,,,318,-1.698855,48.55201
2019-544937,2019-09-23,000001,Vente,150000,5427,,LOT COM DE LA DIME,A007,35120,35010,Baguer-Pican,35,,,35010000AB0354,,,,,,,,,,,,,0,1,Maison,121,5,S,sols,,,860,-1.698734,48.554125
2019-544986,2019-09-20,000001,Vente,1000,,,COMMUN DE LA LANDELLE,B321,35120,35010,Baguer-Pican,35,,,350100000D0406,,,,,,,,,,,,,0,,,,,P,prés,,,10555,-1.702508,48.533905
2019-545061,2019-10-11,000001,Vente,140000,6,B,RUE DE L EGLISE,0016,35120,35010,Baguer-Pican,35,,,35010000AB0155,,,,,,,,,,,,,0,1,Maison,75,3,S,sols,,,86,-1.699446,48.552152
2019-545061,2019-10-11,000001,Vente,140000,,,RUE DE L EGLISE,0016,35120,35010,Baguer-Pican,35,,,35010000AB0503,,,,,,,,,,,,,0,,,,,S,sols,,,97,-1.699543,48.552234
2019-545061,2019-10-11,000001,Vente,140000,6,,RUE DE L EGLISE,0016,35120,35010,Baguer-Pican,35,,,35010000AB0506,,,,,,,,,,,,,0,,,,,S,sols,,,1,-1.699485,48.552268
2019-545061,2019-10-11,000001,Vente,140000,6,,RUE DE L EGLISE,0016,35120,35010,Baguer-Pican,35,,,35010000AB0507,,,,,,,,,,,,,0,,,,,S,sols,,,29,-1.699344,48.55213
2019-545434,2019-10-22,000001,Vente,134500,,,LOT COM DE LA CROIX VERTE,A033,35120,35010,Baguer-Pican,35,,,35010000ZC0106,,,,,,,,,,,,,0,,,,,S,sols,,,31,-1.694469,48.554587
2019-545434,2019-10-22,000001,Vente,134500,4,,IMP DE LA CROIX VERTE,0011,35120,35010,Baguer-Pican,35,,,35010000ZC0108,,,,,,,,,,,,,0,1,Maison,88,4,S,sols,,,756,-1.694561,48.554581
2019-545529,2019-10-26,000001,Vente,189000,,,PONT GALOU,B723,35120,35010,Baguer-Pican,35,,,350100000D1037,,,,,,,,,,,,,0,,,,,S,sols,,,38,-1.707841,48.545629
2019-545529,2019-10-26,000001,Vente,189000,62,B,PONT GALOU,B723,35120,35010,Baguer-Pican,35,,,350100000D1038,,,,,,,,,,,,,0,1,Maison,126,3,S,sols,,,962,-1.707761,48.545542
2019-545560,2019-10-29,000001,Vente,50000,,,VIENNE,B865,35120,35010,Baguer-Pican,35,,,350100000D0940,,,,,,,,,,,,,0,,,,,S,sols,,,139,-1.708437,48.543502
2019-545560,2019-10-29,000001,Vente,50000,,,VIENNE,B865,35120,35010,Baguer-Pican,35,,,350100000D0942,,,,,,,,,,,,,0,,,,,S,sols,,,538,-1.708551,48.543402
2019-545560,2019-10-29,000001,Vente,50000,,,VIENNE,B865,35120,35010,Baguer-Pican,35,,,350100000D0944,,,,,,,,,,,,,0,,,,,S,sols,,,124,-1.708734,48.543349
2019-545598,2019-10-31,000001,Vente,180000,19,,RUE DE PARIS,0044,35120,35010,Baguer-Pican,35,,,35010000AB0022,,,,,,,,,,,,,0,2,Appartement,57,2,S,sols,,,268,-1.69962,48.55315
2019-545598,2019-10-31,000001,Vente,180000,19,,RUE DE PARIS,0044,35120,35010,Baguer-Pican,35,,,35010000AB0022,,,,,,,,,,,,,0,4,Local industriel. commercial ou assimilé,63,0,S,sols,,,268,-1.69962,48.55315
2019-545598,2019-10-31,000001,Vente,180000,19,,RUE DE PARIS,0044,35120,35010,Baguer-Pican,35,,,35010000AB0487,,,,,,,,,,,,,0,3,Dépendance,,0,S,sols,,,109,-1.699728,48.553212
2019-545685,2019-11-12,000001,Vente,380300,,,LA VALLEE,B838,35120,35010,Baguer-Pican,35,,,350100000A0596,,,,,,,,,,,,,0,,,,,J,jardins,POTAG,Jardin potager,1280,-1.718033,48.561021
2019-545685,2019-11-12,000001,Vente,380300,5011,,LA VALLEE,B838,35120,35010,Baguer-Pican,35,,,350100000A0597,,,,,,,,,,,,,0,1,Maison,93,5,S,sols,,,2360,-1.717776,48.560705
2019-545685,2019-11-12,000001,Vente,380300,,,LE CHAMP DU PERY,B115,35120,35010,Baguer-Pican,35,,,350100000A0600,,,,,,,,,,,,,0,,,,,P,prés,,,3265,-1.716746,48.560523
2019-545685,2019-11-12,000001,Vente,380300,,,LA VALLEE,B838,35120,35010,Baguer-Pican,35,,,350100000A0601,,,,,,,,,,,,,0,,,,,S,sols,,,35,-1.717072,48.560646
2019-545685,2019-11-12,000001,Vente,380300,,,LA VALLEE,B838,35120,35010,Baguer-Pican,35,,,350100000A0602,,,,,,,,,,,,,0,,,,,P,prés,,,2270,-1.717531,48.560804
2019-545685,2019-11-12,000001,Vente,380300,,,LA VALLEE,B838,35120,35010,Baguer-Pican,35,,,350100000A0603,,,,,,,,,,,,,0,,,,,P,prés,,,2665,-1.717708,48.56112
2019-545685,2019-11-12,000001,Vente,380300,,,LA CHENEVIERE DU PERY,B217,35120,35010,Baguer-Pican,35,,,350100000A0604,,,,,,,,,,,,,0,,,,,P,prés,,,620,-1.717158,48.561324
2019-545685,2019-11-12,000001,Vente,380300,,,LA CHENEVIERE DU PERY,B217,35120,35010,Baguer-Pican,35,,,350100000A0604,,,,,,,,,,,,,0,,,,,P,prés,,,840,-1.717158,48.561324
2019-545685,2019-11-12,000001,Vente,380300,,,JARDIN DE DERRIERE,B515,35120,35010,Baguer-Pican,35,,,350100000A0605,,,,,,,,,,,,,0,,,,,P,prés,,,1140,-1.716831,48.560975
2019-545685,2019-11-12,000001,Vente,380300,,,LA VALLEE,B838,35120,35010,Baguer-Pican,35,,,350100000A0918,,,,,,,,,,,,,0,,,,,T,terres,,,2565,-1.71719,48.560288
2019-545685,2019-11-12,000001,Vente,380300,,,CHEMIN DE LA VALLEE,B159,35120,35010,Baguer-Pican,35,,,350100000A0964,,,,,,,,,,,,,0,,,,,T,terres,,,324,-1.717575,48.560108
2019-545825,2019-10-30,000001,Vente,167000,3,,LE CHAMP JARRY,B122,35120,35010,Baguer-Pican,35,,,350100000C1132,,,,,,,,,,,,,0,1,Maison,132,5,S,sols,,,523,-1.693567,48.55452
2019-545825,2019-10-30,000001,Vente,167000,,,LE CHAMP JARRY,B122,35120,35010,Baguer-Pican,35,,,350100000C1142,,,,,,,,,,,,,0,,,,,S,sols,,,477,-1.693367,48.554483
2019-545885,2019-11-22,000001,Vente,900,,,LE CLOS TEREC,B308,35120,35010,Baguer-Pican,35,,,350100000C0308,,,,,,,,,,,,,0,,,,,T,terres,,,3690,-1.669205,48.531168
2019-545919,2019-11-19,000001,Vente,135500,5125,,LE PETIT MENIL,B646,35120,35010,Baguer-Pican,35,,,350100000B0498,,,,,,,,,,,,,0,2,Appartement,77,2,S,sols,,,1150,-1.664359,48.549883