id_mutation,date_mutation,numero_disposition,nature_mutation,valeur_fonciere,adresse_numero,adresse_suffixe,adresse_nom_voie,adresse_code_voie,code_postal,code_commune,nom_commune,code_departement,ancien_code_commune,ancien_nom_commune,id_parcelle,ancien_id_parcelle,numero_volume,lot1_numero,lot1_surface_carrez,lot2_numero,lot2_surface_carrez,lot3_numero,lot3_surface_carrez,lot4_numero,lot4_surface_carrez,lot5_numero,lot5_surface_carrez,nombre_lots,code_type_local,type_local,surface_reelle_bati,nombre_pieces_principales,code_nature_culture,nature_culture,code_nature_culture_speciale,nature_culture_speciale,surface_terrain,longitude,latitude
2019-540951,2019-01-08,000001,Vente,43500,,,LOT LES RIVES DU PARC,A030,35720,35226,Pleugueneuc,35,,,35226000ZN0342,,,,,,,,,,,,,0,,,,,AB,terrains a bâtir,,,647,-1.896961,48.396964
2019-541241,2019-01-28,000001,Vente,7381,,,LA CROIX JOSSELIN,B066,35720,35226,Pleugueneuc,35,,,35226000YC0015,,,,,,,,,,,,,0,,,,,L,landes,MAREC,Marécage,4405,-1.9049,48.418538
2019-541241,2019-01-28,000001,Vente,7381,,,LA CROIX JOSSELIN,B066,35720,35226,Pleugueneuc,35,,,35226000YC0015,,,,,,,,,,,,,0,,,,,T,terres,,,6136,-1.9049,48.418538
2019-541241,2019-01-28,000001,Vente,7381,,,LA CROIX JOSSELIN,B066,35720,35226,Pleugueneuc,35,,,35226000YC0015,,,,,,,,,,,,,0,,,,,T,terres,,,17729,-1.9049,48.418538
2019-541468,2019-02-25,000001,Vente,220000,20,,RUE DE LA VALLEE,0066,35720,35226,Pleugueneuc,35,,,35226000YI0070,,,,,,,,,,,,,0,1,Maison,109,5,S,sols,,,559,-1.898726,48.391733
2019-541567,2019-02-28,000001,Vente,73000,,,LA VILLE HUE,B177,35720,35226,Pleugueneuc,35,,,35226000ZN0114,,,,,,,,,,,,,0,,,,,J,jardins,POTAG,Jardin potager,706,-1.880212,48.390933
2019-541567,2019-02-28,000001,Vente,73000,5218,,LA VILLE HUE,B177,35720,35226,Pleugueneuc,35,,,35226000ZN0115,,,,,,,,,,,,,0,1,Maison,65,3,S,sols,,,296,-1.880417,48.390912
2019-541642,2019-02-25,000001,Vente,200000,9,,RUE ALPHONSE SIMON,0005,35720,35226,Pleugueneuc,35,,,35226000ZS0237,,,,,,,,,,,,,0,1,Maison,92,5,S,sols,,,514,-1.905288,48.395291
2019-541644,2019-02-28,000001,Vente,8000,,,LES CHAMPS BIZOU,B041,35720,35226,Pleugueneuc,35,,,35226000ZM0146,,,,,,,,,,,,,0,,,,,T,terres,,,7237,-1.872936,48.389326
2019-541644,2019-02-28,000001,Vente,8000,,,LES CHAMPS BIZOU,B041,35720,35226,Pleugueneuc,35,,,35226000ZM0146,,,,,,,,,,,,,0,,,,,T,terres,,,2413,-1.872936,48.389326
2019-541746,2019-03-08,000001,Vente,136000,10,,SQ D ARMORIQUE,0011,35720,35226,Pleugueneuc,35,,,35226000ZS0138,,,,,,,,,,,,,0,1,Maison,80,4,S,sols,,,497,-1.909488,48.396517
2019-541848,2019-03-08,000001,Vente,665000,,,LA LANDE CLOSE,B101,35720,35226,Pleugueneuc,35,,,35226000ZX0020,,,,,,,,,,,,,0,,,,,T,terres,,,1760,-1.886148,48.431351
2019-541873,2019-03-13,000001,Vente,140000,10,,RUE DE LA LIBERATION,0036,35720,35226,Pleugueneuc,35,,,35226000AB0032,,,,,,,,,,,,,0,1,Maison,144,4,S,sols,,,489,-1.902947,48.398462
2019-542027,2019-04-03,000001,Vente,122000,,,LE MOULIN NEUF,B119,35720,35226,Pleugueneuc,35,,,35226000YK0070,,,,,,,,,,,,,0,,,,,P,prés,,,13960,-1.898777,48.379829
2019-542027,2019-04-03,000001,Vente,122000,,,LE MOULIN NEUF,B119,35720,35226,Pleugueneuc,35,,,35226000YK0072,,,,,,,,,,,,,0,,,,,T,terres,,,19250,-1.899218,48.381466
2019-542027,2019-04-03,000001,Vente,122000,,,LE MOULIN NEUF,B119,35720,35226,Pleugueneuc,35,,,35226000YK0073,,,,,,,,,,,,,0,,,,,T,terres,,,6880,-1.90041,48.381765
2019-542027,2019-04-03,000001,Vente,122000,,,LE MOULIN NEUF,B119,35720,35226,Pleugueneuc,35,,,35226000YK0073,,,,,,,,,,,,,0,,,,,T,terres,,,6880,-1.90041,48.381765
2019-542027,2019-04-03,000001,Vente,122000,,,LE GUE A GAN,B088,35720,35226,Pleugueneuc,35,,,35226000YL0023,,,,,,,,,,,,,0,,,,,T,terres,,,31910,-1.902639,48.384923
2019-542027,2019-04-03,000001,Vente,122000,,,LE GUE A GAN,B088,35720,35226,Pleugueneuc,35,,,35226000YL0023,,,,,,,,,,,,,0,,,,,T,terres,,,31910,-1.902639,48.384923
2019-542027,2019-04-03,000001,Vente,122000,,,LE GUE A GAN,B088,35720,35226,Pleugueneuc,35,,,35226000YL0048,,,,,,,,,,,,,0,,,,,T,terres,,,41730,-1.902313,48.380816
2019-542027,2019-04-03,000001,Vente,122000,,,LE GUE A GAN,B088,35720,35226,Pleugueneuc,35,,,35226000YL0048,,,,,,,,,,,,,0,,,,,P,prés,,,40000,-1.902313,48.380816
2019-542036,2019-03-21,000001,Vente,118500,39,,RUE DE RENNES,0053,35720,35226,Pleugueneuc,35,,,35226000AC0339,,,,,,,,,,,,,0,2,Appartement,80,3,S,sols,,,149,-1.89814,48.395544
2019-542344,2019-04-19,000001,Vente,7036,,,LES CHAMPS BIZOU,B041,35720,35226,Pleugueneuc,35,,,35226000ZM0147,,,,,,,,,,,,,0,,,,,T,terres,,,8795,-1.873621,48.389477
2019-542344,2019-04-19,000001,Vente,7036,,,LES CHAMPS BIZOU,B041,35720,35226,Pleugueneuc,35,,,35226000ZM0147,,,,,,,,,,,,,0,,,,,T,terres,,,8795,-1.873621,48.389477
2019-542557,2019-05-14,000001,Vente,24000,,,L HOPITAL,B095,35720,35226,Pleugueneuc,35,,,35226000ZX0034,,,,,,,,,,,,,0,,,,,S,sols,,,80,-1.884075,48.421666
2019-542557,2019-05-14,000001,Vente,24000,,,L HOPITAL,B095,35720,35226,Pleugueneuc,35,,,35226000ZX0035,,,,,,,,,,,,,0,,,,,S,sols,,,42,-1.884062,48.421551
2019-542557,2019-05-14,000001,Vente,24000,,,L HOPITAL,B095,35720,35226,Pleugueneuc,35,,,35226000ZX0036,,,,,,,,,,,,,0,,,,,S,sols,,,188,-1.884153,48.421622
2019-542773,2019-05-03,000001,Vente,30000,22,,RUE DE RENNES,0053,35720,35226,Pleugueneuc,35,,,35226000AC0256,,,,,,,,,,,,,0,1,Maison,103,3,J,jardins,POTAG,Jardin potager,52,-1.90213,48.396582
2019-542773,2019-05-03,000001,Vente,30000,22,,RUE DE RENNES,0053,35720,35226,Pleugueneuc,35,,,35226000AC0256,,,,,,,,,,,,,0,1,Maison,103,3,S,sols,,,500,-1.90213,48.396582
2019-542812,2019-05-22,000001,Vente,40000,,,LA GOUHEDRAIS,B082,35720,35226,Pleugueneuc,35,,,35226000AB0176,,,,,,,,,,,,,0,,,,,S,sols,,,179,-1.904482,48.400206
2019-542812,2019-05-22,000001,Vente,40000,,,RUE DE LA LIBERATION,0036,35720,35226,Pleugueneuc,35,,,35226000AB0186,,,,,,,,,,,,,0,,,,,S,sols,,,71,-1.904128,48.400431
2019-542848,2019-05-23,000001,Vente,297000,5003,,LES BRUYERES,B025,35720,35226,Pleugueneuc,35,,,35226000ZA0043,,,,,,,,,,,,,0,1,Maison,148,9,S,sols,,,1000,-1.87689,48.421869
2019-542848,2019-05-23,000001,Vente,297000,5003,,LES BRUYERES,B025,35720,35226,Pleugueneuc,35,,,35226000ZA0043,,,,,,,,,,,,,0,1,Maison,60,2,AG,terrains d'agrément,,,107,-1.87689,48.421869
2019-542848,2019-05-23,000001,Vente,297000,5003,,LES BRUYERES,B025,35720,35226,Pleugueneuc,35,,,35226000ZA0043,,,,,,,,,,,,,0,1,Maison,60,2,S,sols,,,1000,-1.87689,48.421869
2019-542848,2019-05-23,000001,Vente,297000,5003,,LES BRUYERES,B025,35720,35226,Pleugueneuc,35,,,35226000ZA0043,,,,,,,,,,,,,0,1,Maison,148,9,AG,terrains d'agrément,,,107,-1.87689,48.421869
2019-542848,2019-05-23,000001,Vente,297000,,,LES BRUYERES,B025,35720,35226,Pleugueneuc,35,,,35226000ZA0044,,,,,,,,,,,,,0,,,,,T,terres,,,2800,-1.877014,48.421952
2019-543009,2019-05-24,000001,Vente,30000,,,LE PERQUER,B126,35720,35226,Pleugueneuc,35,,,35226000ZM0062,,,,,,,,,,,,,0,,,,,J,jardins,POTAG,Jardin potager,673,-1.863496,48.387575
2019-543009,2019-05-24,000001,Vente,30000,5139,,LE PERQUER,B126,35720,35226,Pleugueneuc,35,,,35226000ZM0063,,,,,,,,,,,,,0,1,Maison,72,1,S,sols,,,233,-1.863258,48.387311
2019-543009,2019-05-24,000001,Vente,30000,,,LE CHAMP PEZON,B032,35720,35226,Pleugueneuc,35,,,35226000ZM0193,,,,,,,,,,,,,0,,,,,S,sols,,,220,-1.863484,48.387453
2019-543009,2019-05-24,000001,Vente,30000,,,LE CHAMP PEZON,B032,35720,35226,Pleugueneuc,35,,,35226000ZM0279,,,,,,,,,,,,,0,,,,,T,terres,,,539,-1.86365,48.387311
2019-543009,2019-05-24,000001,Vente,30000,,,LE CHAMP PEZON,B032,35720,35226,Pleugueneuc,35,,,35226000ZM0280,,,,,,,,,,,,,0,,,,,T,terres,,,747,-1.863774,48.38753
2019-543096,2019-05-29,000001,Vente,152500,9001,,LE BREIL CAULNETTE,B023,35720,35226,Pleugueneuc,35,,,35226000YD0044,,,,,,,,,,,,,0,1,Maison,88,5,S,sols,,,600,-1.896451,48.412268
2019-543096,2019-05-29,000001,Vente,152500,9001,,LE BREIL CAULNETTE,B023,35720,35226,Pleugueneuc,35,,,35226000YD0044,,,,,,,,,,,,,0,1,Maison,88,5,AG,terrains d'agrément,,,552,-1.896451,48.412268
2019-543097,2019-06-03,000001,Vente,67000,68,,RUE DE RENNES,0053,35720,35226,Pleugueneuc,35,,,35226000ZP0020,,,,,,,,,,,,,0,1,Maison,92,3,S,sols,,,560,-1.896341,48.392516
2019-543097,2019-06-03,000001,Vente,67000,,,CHAMPAGNE DU MOULIN A VENT,B040,35720,35226,Pleugueneuc,35,,,35226000ZP0443,,,,,,,,,,,,,0,,,,,J,jardins,POTAG,Jardin potager,356,-1.896441,48.392584
2019-543101,2019-06-05,000001,Vente,138000,10,,SQ DE BROCELIANDE,0018,35720,35226,Pleugueneuc,35,,,35226000AB0205,,,,,,,,,,,,,0,1,Maison,71,4,S,sols,,,760,-1.905165,48.401183
2019-543166,2019-06-24,000002,Vente,13400,,,CHAMPAGNE DU MOULIN A VENT,B040,35720,35226,Pleugueneuc,35,,,35226000ZP0441,,,,,,,,,,,,,0,,,,,S,sols,,,134,-1.899624,48.39437
2019-543240,2019-06-18,000001,Vente,143380,1,,RUE DE RENNES,0053,35720,35226,Pleugueneuc,35,,,35226000AC0356,,,,,,,,,,,,,0,1,Maison,83,4,S,sols,,,153,-1.902513,48.397705
2019-543240,2019-06-18,000001,Vente,143380,1,,RUE DE RENNES,0053,35720,35226,Pleugueneuc,35,,,35226000AC0356,,,,,,,,,,,,,0,1,Maison,112,4,S,sols,,,153,-1.902513,48.397705
2019-543287,2019-06-27,000001,Vente,193600,2,,RUE DES COTEAUX,0026,35720,35226,Pleugueneuc,35,,,35226000ZP0338,,,,,,,,,,,,,0,1,Maison,113,5,S,sols,,,568,-1.899067,48.392791
2019-543540,2019-07-03,000001,Vente,100000,5500,,PITREL,B136,35720,35226,Pleugueneuc,35,,,35226000ZC0077,,,,,,,,,,,,,0,1,Maison,139,3,S,sols,,,106,-1.889537,48.408887
2019-543540,2019-07-03,000001,Vente,100000,,,PITREL,B136,35720,35226,Pleugueneuc,35,,,35226000ZD0033,,,,,,,,,,,,,0,,,,,S,sols,,,37,-1.889493,48.408766
2019-543540,2019-07-03,000001,Vente,100000,,,PITREL,B136,35720,35226,Pleugueneuc,35,,,35226000ZD0034,,,,,,,,,,,,,0,,,,,T,terres,,,2030,-1.889565,48.408605
2019-543557,2019-06-21,000001,Vente,169000,5660,,LA CHENAIRIE,B049,35720,35226,Pleugueneuc,35,,,35226000ZK0056,,,,,,,,,,,,,0,1,Maison,227,7,S,sols,,,85,,
2019-543557,2019-06-21,000001,Vente,169000,,,LA CHENAIRIE,B049,35720,35226,Pleugueneuc,35,,,35226000ZK0057,,,,,,,,,,,,,0,,,,,S,sols,,,104,,
2019-543557,2019-06-21,000001,Vente,169000,,,LA CHENAIRIE,B049,35720,35226,Pleugueneuc,35,,,35226000ZK0160,,,,,,,,,,,,,0,,,,,S,sols,,,85,-1.863855,48.396424
2019-543557,2019-06-21,000001,Vente,169000,,,LA CHENAIRIE,B049,35720,35226,Pleugueneuc,35,,,35226000ZK0163,,,,,,,,,,,,,0,,,,,S,sols,,,17,-1.864033,48.396336
2019-543557,2019-06-21,000001,Vente,169000,,,LA CHENAIRIE,B049,35720,35226,Pleugueneuc,35,,,35226000ZK0164,,,,,,,,,,,,,0,,,,,S,sols,,,44,-1.863977,48.396339
2019-543557,2019-06-21,000001,Vente,169000,,,LA CHENAIRIE,B049,35720,35226,Pleugueneuc,35,,,35226000ZK0165,,,,,,,,,,,,,0,,,,,S,sols,,,7,-1.863879,48.396348
2019-543562,2019-07-11,000001,Vente,2000000,,,LE LEIX,B108,35720,35226,Pleugueneuc,35,,,35226000ZY0062,,,,,,,,,,,,,0,,,,,AB,terrains a bâtir,,,10000,-1.910423,48.426098
2019-543562,2019-07-11,000001,Vente,2000000,9001,,LE LEIX,B108,35720,35226,Pleugueneuc,35,,,35226000ZY0063,,,,,,,,,,,,,0,4,Local industriel. commercial ou assimilé,1500,0,S,sols,,,10000,-1.909335,48.425963
2019-543562,2019-07-11,000001,Vente,2000000,,,LE LEIX,B108,35720,35226,Pleugueneuc,35,,,35226000ZY0079,,,,,,,,,,,,,0,,,,,AG,terrains d'agrément,,,9286,-1.908107,48.425712
2019-543562,2019-07-11,000001,Vente,2000000,,,LE LEIX,B108,35720,35226,Pleugueneuc,35,,,35226000ZY0094,,,,,,,,,,,,,0,,,,,AG,terrains d'agrément,,,224,-1.907473,48.425317
2019-543576,2019-06-24,000001,Vente,90000,2,,PL DE L EGLISE,0031,35720,35226,Pleugueneuc,35,,,35226000AB0293,,,3,57.26,,,,,,,,,1,2,Appartement,57,4,,,,,,-1.90384,48.398274
2019-543576,2019-06-24,000001,Vente,90000,2,,PL DE L EGLISE,0031,35720,35226,Pleugueneuc,35,,,35226000AB0293,,,26,,,,,,,,,,1,3,Dépendance,,0,,,,,,-1.90384,48.398274
2019-543579,2019-06-26,000001,Vente,1160,,,LA CROIX JOSSELIN,B066,35720,35226,Pleugueneuc,35,,,35226000ZT0103,,,,,,,,,,,,,0,,,,,L,landes,MAREC,Marécage,995,-1.903333,48.419285
2019-543579,2019-06-26,000001,Vente,1160,,,LA CROIX JOSSELIN,B066,35720,35226,Pleugueneuc,35,,,35226000ZT0103,,,,,,,,,,,,,0,,,,,BT,taillis simples,,,1325,-1.903333,48.419285
2019-543688,2019-07-16,000001,Vente,300,,,LA PRAIRIE DE LINON,B146,35720,35226,Pleugueneuc,35,,,35226000ZO0079,,,,,,,,,,,,,0,,,,,P,prés,,,1780,-1.873489,48.379856
2019-544299,2019-08-13,000002,Vente,117500,5514,,LE BREIL CAULNETTE,B023,35720,35226,Pleugueneuc,35,,,35226000ZT0113,,,,,,,,,,,,,0,1,Maison,52,2,S,sols,,,1900,-1.897165,48.414453
2019-544365,2019-08-16,000001,Vente,99000,,,LE PONT DOLAY,B141,35720,35226,Pleugueneuc,35,,,35226000ZP0263,,,,,,,,,,,,,0,,,,,S,sols,,,12,-1.895054,48.383389
2019-544365,2019-08-16,000001,Vente,99000,,,LE PONT DOLAY,B141,35720,35226,Pleugueneuc,35,,,35226000ZP0404,,,,,,,,,,,,,0,,,,,S,sols,,,17,-1.895069,48.383428
2019-544365,2019-08-16,000001,Vente,99000,5232,,LE PONT DOLAY,B141,35720,35226,Pleugueneuc,35,,,35226000ZP0405,,,,,,,,,,,,,0,1,Maison,50,3,S,sols,,,195,-1.895103,48.383348
2019-544365,2019-08-16,000001,Vente,99000,,,LE PONT DOLAY,B141,35720,35226,Pleugueneuc,35,,,35226000ZP0407,,,,,,,,,,,,,0,,,,,T,terres,,,243,-1.895321,48.383312
2019-544387,2019-08-19,000001,Vente,72412,25,,RUE ALPHONSE SIMON,0005,35720,35226,Pleugueneuc,35,,,35226000ZS0354,,,,,,,,,,,,,0,,,,,S,sols,,,338,-1.906545,48.395587
2019-544722,2019-09-10,000001,Vente,5600,,,LE PONT PICHARD,B142,35720,35226,Pleugueneuc,35,,,35226000YH0038,,,,,,,,,,,,,0,,,,,P,prés,,,6325,-1.913545,48.397241
2019-544722,2019-09-10,000001,Vente,5600,,,LE PONT PICHARD,B142,35720,35226,Pleugueneuc,35,,,35226000YH0038,,,,,,,,,,,,,0,,,,,T,terres,,,6200,-1.913545,48.397241
2019-544725,2019-09-10,000001,Vente,2300,,,LES BOIS COLOMBIERES,B014,35720,35226,Pleugueneuc,35,,,35226000ZH0023,,,,,,,,,,,,,0,,,,,P,prés,,,1415,-1.847788,48.414454
2019-544725,2019-09-10,000001,Vente,2300,,,LES BOIS COLOMBIERES,B014,35720,35226,Pleugueneuc,35,,,35226000ZH0023,,,,,,,,,,,,,0,,,,,BT,taillis simples,,,6555,-1.847788,48.414454
2019-544842,2019-09-18,000001,Vente,50586,23,,RUE ALPHONSE SIMON,0005,35720,35226,Pleugueneuc,35,,,35226000ZS0351,,,,,,,,,,,,,0,,,,,S,sols,,,327,-1.906227,48.395623
2019-544885,2019-09-24,000001,Vente,2300,,,LE BAS COUEDAN,B005,35720,35226,Pleugueneuc,35,,,35226000ZO0052,,,,,,,,,,,,,0,,,,,T,terres,,,2660,-1.872663,48.382363
2019-544885,2019-09-24,000001,Vente,2300,,,LE BAS COUEDAN,B005,35720,35226,Pleugueneuc,35,,,35226000ZO0052,,,,,,,,,,,,,0,,,,,T,terres,,,2660,-1.872663,48.382363
2019-545032,2019-09-25,000001,Vente,137000,5147,,LE PERQUER,B126,35720,35226,Pleugueneuc,35,,,35226000ZM0092,,,,,,,,,,,,,0,1,Maison,108,5,S,sols,,,59,-1.864859,48.386343
2019-545032,2019-09-25,000001,Vente,137000,,,LE PERQUER,B126,35720,35226,Pleugueneuc,35,,,35226000ZM0226,,,,,,,,,,,,,0,,,,,S,sols,,,475,-1.864744,48.38631
2019-545032,2019-09-25,000001,Vente,137000,,,LE PERQUER,B126,35720,35226,Pleugueneuc,35,,,35226000ZM0229,,,,,,,,,,,,,0,,,,,S,sols,,,80,-1.864655,48.386444
2019-545116,2019-10-02,000001,Vente,25000,,,DERRIERE LA VILLE,B070,35720,35226,Pleugueneuc,35,,,35226000ZL0185,,,,,,,,,,,,,0,,,,,P,prés,,,854,-1.863411,48.382124
2019-545385,2019-10-18,000001,Vente,78000,8,,RUE DE COETQUEN,0022,35720,35226,Pleugueneuc,35,,,35226000AB0158,,,,,,,,,,,,,0,1,Maison,70,2,S,sols,,,595,-1.904716,48.399188
2019-545388,2019-10-16,000001,Vente,29900,6,,RUE DES CHATAIGNIERS,0020,35720,35226,Pleugueneuc,35,,,35226000ZN0334,,,,,,,,,,,,,0,2,Appartement,62,3,AB,terrains a bâtir,,,383,-1.897629,48.397798
2019-545419,2019-10-17,000001,Vente,440,,,LE PONT PICHARD,B142,35720,35226,Pleugueneuc,35,,,35226000YH0037,,,,,,,,,,,,,0,,,,,T,terres,,,1490,-1.912814,48.396272
2019-545445,2019-09-09,000002,Vente,36000,,,LA PINHOUETTIERE,B134,35720,35226,Pleugueneuc,35,,,35226000ZS0356,,,,,,,,,,,,,0,,,,,T,terres,,,765,-1.906326,48.400486
2019-545730,2019-10-28,000001,Vente,69834,10,,RUE ALPHONSE SIMON,0005,35720,35226,Pleugueneuc,35,,,35226000ZS0321,,,,,,,,,,,,,0,,,,,S,sols,,,13,-1.906756,48.395745
2019-545730,2019-10-28,000001,Vente,69834,10,,RUE ALPHONSE SIMON,0005,35720,35226,Pleugueneuc,35,,,35226000ZS0327,,,,,,,,,,,,,0,,,,,S,sols,,,337,-1.906783,48.39586
2019-545882,2019-11-13,000001,Vente,40500,,,LOT LES RIVES DU PARC,A030,35720,35226,Pleugueneuc,35,,,35226000ZN0323,,,,,,,,,,,,,0,,,,,AB,terrains a bâtir,,,536,-1.896492,48.398261
2019-545893,2019-11-20,000001,Vente,9135,,,LES TOUCHES FERRON,B167,35720,35226,Pleugueneuc,35,,,35226000ZB0038,,,,,,,,,,,,,0,,,,,T,terres,,,2473,-1.881012,48.41396
2019-545893,2019-11-20,000001,Vente,9135,,,LES TOUCHES FERRON,B167,35720,35226,Pleugueneuc,35,,,35226000ZB0038,,,,,,,,,,,,,0,,,,,T,terres,,,7417,-1.881012,48.41396
2019-545893,2019-11-20,000001,Vente,9135,,,LA CHAMPAGNE DES PIERRES,B038,35720,35226,Pleugueneuc,35,,,35226000ZC0150,,,,,,,,,,,,,0,,,,,T,terres,,,6285,-1.888543,48.414932
2019-545893,2019-11-20,000001,Vente,9135,,,LA CHAMPAGNE DES PIERRES,B038,35720,35226,Pleugueneuc,35,,,35226000ZC0150,,,,,,,,,,,,,0,,,,,T,terres,,,2095,-1.888543,48.414932
2019-545959,2019-11-25,000001,Vente,140000,,,LA MARE,B109,35720,35226,Pleugueneuc,35,,,35226000ZM0251,,,,,,,,,,,,,0,,,,,T,terres,,,205,-1.8727,48.384964
2019-545959,2019-11-25,000001,Vente,140000,5164,,LE HAUT COUEDAN,B089,35720,35226,Pleugueneuc,35,,,35226000ZM0253,,,,,,,,,,,,,0,1,Maison,75,4,S,sols,,,538,-1.872666,48.385102
2019-545959,2019-11-25,000001,Vente,140000,5178,,LE HAUT COUEDAN,B089,35720,35226,Pleugueneuc,35,,,35226000ZO0266,,,,,,,,,,,,,0,1,Maison,30,1,S,sols,,,88,-1.873029,48.385
2019-545999,2019-11-29,000001,Vente,165000,5001,,LE BAS COUEDAN,B005,35720,35226,Pleugueneuc,35,,,35226000ZM0108,,,,,,,,,,,,,0,1,Maison,99,5,S,sols,,,500,-1.870484,48.384169
2019-545999,2019-11-29,000001,Vente,165000,5001,,LE BAS COUEDAN,B005,35720,35226,Pleugueneuc,35,,,35226000ZM0108,,,,,,,,,,,,,0,1,Maison,99,5,AG,terrains d'agrément,,,340,-1.870484,48.384169
2019-546057,2019-11-27,000001,Vente,44000,,,CHAMPAGNE DU MOULIN A VENT,B040,35720,35226,Pleugueneuc,35,,,35226000YI0076,,,,,,,,,,,,,0,,,,,AB,terrains a bâtir,,,550,-1.897452,48.392266
2019-546058,2019-11-26,000001,Vente,13648,,,CHAMPAGNE DU MOULIN A VENT,B040,35720,35226,Pleugueneuc,35,,,35226000YK0005,,,,,,,,,,,,,0,,,,,T,terres,,,1792,-1.895195,48.389864
2019-546058,2019-11-26,000001,Vente,13648,,,CHAMPAGNE DU MOULIN A VENT,B040,35720,35226,Pleugueneuc,35,,,35226000YK0005,,,,,,,,,,,,,0,,,,,T,terres,,,1792,-1.895195,48.389864
2019-546058,2019-11-26,000001,Vente,13648,,,CHAMPAGNE DU MOULIN A VENT,B040,35720,35226,Pleugueneuc,35,,,35226000YK0005,,,,,,,,,,,,,0,,,,,T,terres,,,5376,-1.895195,48.389864
2019-546058,2019-11-26,000001,Vente,13648,,,CHAMPAGNE DU MOULIN A VENT,B040,35720,35226,Pleugueneuc,35,,,35226000YK0006,,,,,,,,,,,,,0,,,,,T,terres,,,4274,-1.894657,48.389544
2019-546058,2019-11-26,000001,Vente,13648,,,CHAMPAGNE DU MOULIN A VENT,B040,35720,35226,Pleugueneuc,35,,,35226000YK0006,,,,,,,,,,,,,0,,,,,T,terres,,,12822,-1.894657,48.389544
2019-546058,2019-11-26,000001,Vente,13648,,,CHAMPAGNE DU MOULIN A VENT,B040,35720,35226,Pleugueneuc,35,,,35226000YK0006,,,,,,,,,,,,,0,,,,,T,terres,,,4274,-1.894657,48.389544
2019-546186,2019-12-10,000001,Vente,80000,5516,,LE BREIL CAULNETTE,B023,35720,35226,Pleugueneuc,35,,,35226000ZT0116,,,,,,,,,,,,,0,1,Maison,35,2,S,sols,,,94,-1.897324,48.414201
2019-546186,2019-12-10,000001,Vente,80000,,,LE BREIL CAULNETTE,B023,35720,35226,Pleugueneuc,35,,,35226000ZT0117,,,,,,,,,,,,,0,,,,,T,terres,,,635,-1.897205,48.414004
2019-546186,2019-12-10,000001,Vente,80000,5755,,LE BREIL CAULNETTE,B023,35720,35226,Pleugueneuc,35,,,35226000ZT0131,,,,,,,,,,,,,0,3,Dépendance,,0,S,sols,,,280,-1.897549,48.414057
2019-546219,2019-12-17,000001,Vente,162500,1,,IMP DES TILLEULS,0063,35720,35226,Pleugueneuc,35,,,35226000ZN0346,,,,,,,,,,,,,0,1,Maison,89,4,S,sols,,,352,-1.89674,48.396665
2019-546295,2019-10-23,000001,Vente,65000,,,RUE DU BOURG,0016,35720,35226,Pleugueneuc,35,,,35226000AB0054,,,,,,,,,,,,,0,,,,,S,sols,,,465,-1.902053,48.398136
2019-546295,2019-10-23,000001,Vente,65000,9,B,RUE DU BOURG,0016,35720,35226,Pleugueneuc,35,,,35226000AB0055,,,,,,,,,,,,,0,3,Dépendance,,0,S,sols,,,44,-1.902,48.397946
2019-546441,2019-12-17,000001,Vente,155000,5142,,LE PERQUER,B126,35720,35226,Pleugueneuc,35,,,35226000ZM0084,,,,,,,,,,,,,0,1,Maison,56,1,S,sols,,,1890,-1.863927,48.386744
2019-546441,2019-12-17,000001,Vente,155000,,,LE PERQUER,B126,35720,35226,Pleugueneuc,35,,,35226000ZM0085,,,,,,,,,,,,,0,,,,,S,sols,,,125,-1.86401,48.386874
2019-546441,2019-12-17,000001,Vente,155000,,,LE POMMEREAU,B140,35720,35226,Pleugueneuc,35,,,35226000ZM0268,,,,,,,,,,,,,0,,,,,T,terres,,,118,-1.863459,48.386534
2019-546443,2019-12-16,000001,Vente,17060,,,LA BARRE,B003,35720,35226,Pleugueneuc,35,,,35226000YL0017,,,,,,,,,,,,,0,,,,,T,terres,,,24370,-1.908966,48.388441
2019-546444,2019-12-19,000001,Vente,64325,8,,RUE ALPHONSE SIMON,0005,35720,35226,Pleugueneuc,35,,,35226000ZS0322,,,,,,,,,,,,,0,,,,,S,sols,,,21,-1.90659,48.395787
2019-546444,2019-12-19,000001,Vente,64325,8,,RUE ALPHONSE SIMON,0005,35720,35226,Pleugueneuc,35,,,35226000ZS0326,,,,,,,,,,,,,0,1,Maison,79,4,S,sols,,,337,-1.906678,48.395859
2019-546444,2019-12-19,000001,Vente,64325,8,,RUE ALPHONSE SIMON,0005,35720,35226,Pleugueneuc,35,,,35226000ZS0326,,,,,,,,,,,,,0,1,Maison,79,4,S,sols,,,337,-1.906678,48.395859
2019-546444,2019-12-19,000001,Vente,64325,8,,RUE ALPHONSE SIMON,0005,35720,35226,Pleugueneuc,35,,,35226000ZS0326,,,,,,,,,,,,,0,1,Maison,79,4,S,sols,,,337,-1.906678,48.395859
2019-546444,2019-12-19,000001,Vente,64325,8,,RUE ALPHONSE SIMON,0005,35720,35226,Pleugueneuc,35,,,35226000ZS0326,,,,,,,,,,,,,0,1,Maison,79,4,S,sols,,,337,-1.906678,48.395859
2019-546444,2019-12-19,000001,Vente,64325,8,,RUE ALPHONSE SIMON,0005,35720,35226,Pleugueneuc,35,,,35226000ZS0326,,,,,,,,,,,,,0,1,Maison,65,3,S,sols,,,337,-1.906678,48.395859
2019-546444,2019-12-19,000001,Vente,64325,8,,RUE ALPHONSE SIMON,0005,35720,35226,Pleugueneuc,35,,,35226000ZS0326,,,,,,,,,,,,,0,1,Maison,65,3,S,sols,,,337,-1.906678,48.395859
2019-546451,2019-12-13,000001,Vente,119000,2,,PL DE L EGLISE,0031,35720,35226,Pleugueneuc,35,,,35226000AB0293,,,9,88.49,,,,,,,,,1,2,Appartement,88,4,,,,,,-1.90384,48.398274
2019-546451,2019-12-13,000001,Vente,119000,2,,PL DE L EGLISE,0031,35720,35226,Pleugueneuc,35,,,35226000AB0293,,,17,,,,,,,,,,1,3,Dépendance,,0,,,,,,-1.90384,48.398274
2019-546451,2019-12-13,000001,Vente,119000,2,,PL DE L EGLISE,0031,35720,35226,Pleugueneuc,35,,,35226000AB0293,,,24,,,,,,,,,,1,3,Dépendance,,0,,,,,,-1.90384,48.398274
